program: Gaussian 09
title: 000117428
version: EM64L-G09RevD.01
frameworkgroup: C1[X(C11H15N)]
method: RPBEPBE
basis: SDD
operation: Freq
keyword: #pfreq=noraman
keyword: PBEPBE/SDD
title: #p freq=noraman PBEPBE/SDD
converged: YES YES NO NO
title: Mulliken charges:
elementType: N C C C C C C C C C C C H H H H H H H H H H H H H H H
charge: -0.180059 -0.383891 -0.414629 -0.532745 0.270348 0.346091 -0.371206 -0.373649 -0.410156 -0.681770 -0.254802 -0.275202 0.206433 0.206010 0.221063 0.199634 0.225115 0.214984 0.221108 0.205880 0.222246 0.222785 0.222080 0.242590 0.212966 0.217100 0.221671
chargesum: 0.00000
title: Mulliken charges with hydrogens summed into heavy atoms:
elementType: N C C C C C C C C C C C
charge: -0.180059 0.028553 0.006069 -0.092645 0.270348 0.346091 0.055783 -0.151403 -0.187371 -0.004134 -0.037702 -0.053531
polarizability: 1.58463756e+02 6.20224566e+00 1.34358976e+02 -4.06334810e+00 6.26508810e+00 7.55231731e+01
1716.lowfreq: -17.3815 -12.2386 -0.0004 -0.0004 -0.0001 5.5366 55.2213 86.7562 99.8442
frequency: 55.0448 86.6822 99.8362 151.2763 201.9066 252.7579 298.6119 324.7005 365.0362 422.0884 429.8694 453.7604 497.8336 535.8663 545.5744 596.8853 683.2567 719.0363 747.6707 775.3933 789.4413 836.0013 866.1804 872.9224 905.7960 929.0668 945.2546 962.4100 1006.9928 1041.3305 1061.1535 1076.7442 1082.5681 1105.4380 1137.4691 1167.8655 1173.0287 1195.5246 1202.7323 1222.8464 1254.6543 1276.0344 1294.9533 1330.9580 1341.4051 1342.7588 1350.7551 1380.3487 1381.2838 1393.8996 1448.4195 1458.1330 1465.1491 1466.6901 1476.9810 1481.6455 1492.3499 1508.5052 1579.4209 1617.4056 2904.4748 2957.5726 2981.6993 2985.2751 2996.9556 3018.6359 3031.2627 3034.3163 3063.0614 3076.8106 3090.3957 3106.9223 3123.8552 3151.8542 3165.2492
redmass: 2.9253 2.6115 2.7656 3.2324 1.0541 3.2859 1.9665 2.8090 3.4026 2.7275 2.8459 3.5054 3.8579 3.0770 4.0924 2.5744 4.2663 2.3331 1.5475 1.3345 2.6044 1.3905 1.9202 1.6306 2.4110 1.3872 2.3698 1.3039 2.4807 2.5084 2.3023 1.7509 1.8736 1.9584 1.5627 1.4003 1.1529 1.4428 1.7909 2.4028 1.3400 1.3437 1.4644 1.4426 1.6299 1.2908 1.4238 1.3092 4.5035 1.6851 2.2025 1.1617 1.1128 1.0673 1.0700 1.1515 1.2195 1.9837 6.6928 6.3557 1.0700 1.0661 1.0367 1.0593 1.0636 1.0895 1.0926 1.1016 1.1043 1.0994 1.1008 1.0880 1.0875 1.0931 1.0978
irintensity: 0.1925 0.1946 3.2460 1.7672 0.1188 1.9164 2.7143 0.4161 5.9577 5.6570 1.9692 1.4664 1.8652 0.8990 1.6254 2.0794 1.2223 11.2410 86.0184 7.9159 8.3155 1.7185 1.4710 5.3238 2.8885 3.1964 8.0154 0.0399 10.5808 10.4032 6.0534 4.4762 17.1297 6.4066 8.2109 6.6034 0.8479 7.3759 41.3467 23.9132 2.5752 50.0088 12.4610 58.1515 37.8900 16.8588 3.2274 18.9625 16.1257 3.9136 34.3315 4.2889 5.5794 10.9221 10.5660 11.3996 17.1794 134.9141 12.7927 93.6771 91.0094 38.6461 31.0766 56.3303 19.5209 55.2908 44.1758 24.0029 48.9236 48.6093 42.3274 16.9314 12.7513 40.6121 21.5753
temp: 298.150 k
press: 1.00000 atm
elementType: 7 6 6 6 6 6 6 6 6 6 6 6 1 1 1 1 1 1 1 1 1 1 1 1 1 1 1
symmnumber: 1
zpe: 615203.2 jmol-1
zpe.correction: 0.234319 hartree
zpe.thermalcorrener: 0.245217 hartree
zpe.thermalcorrenthalpy: 0.246161 hartree
zpe.thermalcorrgfe: 0.197694 hartree
zpe.sumelectzpe: -482.020812 hartree
zpe.sumelectthermal: -482.009914 hartree
zpe.sumelectthermalent: -482.008970 hartree
zpe.sumelectthermalfe: -482.057437 hartree
dipole: 2.2871 0.7887 0.1509
dipole: 2.4240
quadrupole: -67.8970 -66.5066 -76.5858
quadrupole: -0.9605 -1.1516 1.7671
quadrupole: 2.4328 3.8232 -6.2560 -0.9605 -1.1516 1.7671
hfenergy: -482.255131 hartree
pointgroup: C01 [X(C11H15N1)]
dipole: -0.9232573 -0.229274 0.0671765 debye
polarizability: 159.4401555|3.8639011|133.5618224|2.6259544|-6.124721|75.3439278 unknown
InChI: InChI=1S/C11H15N/c1-2-12-9-5-7-10-6-3-4-8-11(10)12/h3-4,6,8H,2,5,7,9H2,1H3
charge 0 multiplicity 1
27 atoms
N  -1.330741 0.100788 -0.285249
C  -1.970356 -1.183194 0.064047
C  -1.088052 -2.37344 -0.356573
C  0.285126 -2.264682 0.336458
C  0.063269 0.255076 -0.140007
C  0.897978 -0.882364 0.140416
C  -2.217847 1.264623 -0.447688
C  0.691028 1.530937 -0.287976
C  2.294853 -0.7090 0.233661
C  -2.535482 2.014504 0.871023
C  2.089472 1.673127 -0.184531
C  2.910163 0.553809 0.07691
H  -2.9462 -1.229334 -0.45572
H  -2.177029 -1.249896 1.157473
H  -0.962513 -2.359266 -1.455436
H  -1.590939 -3.319648 -0.082828
H  0.974967 -3.03945 -0.04727
H  0.158258 -2.470095 1.420243
H  -1.774566 1.963998 -1.181181
H  -3.162093 0.903898 -0.898839
H  0.08993 2.424108 -0.481218
H  2.915137 -1.59248 0.435468
H  -3.050289 1.35066 1.588897
H  -1.610273 2.381139 1.348876
H  -3.192771 2.882647 0.67644
H  2.534681 2.66784 -0.305177
H  3.996888 0.659793 0.157583
