program: Gaussian 09
title: 000117427
version: EM64L-G09RevD.01
frameworkgroup: C1[X(C12H16O5S)]
method: RPBEPBE
basis: SDD
operation: Freq
keyword: #p
keyword: freq=noraman
keyword: PBEPBE/SDD
title: #p freq=noraman PBEPBE/SDD
converged: NO YES NO NO
title: Mulliken charges:
elementType: S O O O O O C C C C C C C C C C C C H H H H H H H H H H H H H H H H
charge: 0.182676 -0.253633 -0.426434 -0.417197 -0.443671 -0.442069 -0.069616 -0.142836 -0.162415 -0.074989 -0.441159 -0.354137 -0.150678 -0.257685 -0.253760 -0.211866 -0.225135 -0.230015 0.223512 0.259366 0.254868 0.248420 0.295743 0.214785 0.219899 0.358777 0.335498 0.355114 0.364869 0.251281 0.283772 0.232319 0.242831 0.233564
chargesum: 0.00000
title: Mulliken charges with hydrogens summed into heavy atoms:
elementType: S O O O O O C C C C C C C C C C C C
charge: 0.182676 -0.253633 -0.067657 -0.081699 -0.088557 -0.077200 0.153897 0.116530 0.092452 0.173431 -0.145417 0.080546 -0.150678 -0.006404 0.030012 0.020453 0.017696 0.003549
polarizability: 2.13258656e+02 3.24833542e+00 1.61375327e+02 1.15523385e+01 -9.37011962e+00 1.09807690e+02
1716.lowfreq: -12.5380 -5.4598 -2.4389 -0.0022 -0.0015 -0.0008 24.8665 37.5465 56.8492
frequency: 24.3167 36.9734 56.8322 73.6240 89.0203 106.5521 108.7058 147.6470 162.9864 209.3991 226.1441 231.8041 258.6128 270.4561 275.7941 321.6559 341.6727 353.1803 380.5418 398.8024 405.4490 423.9680 441.8794 448.4343 469.6132 491.3665 556.1982 588.5419 610.8951 658.7898 662.9828 679.8255 701.4816 749.9597 755.4639 769.8977 844.0809 854.9715 918.3643 931.8041 952.2407 969.0482 980.5373 986.0675 987.3901 1001.5627 1007.5460 1014.8052 1019.7534 1042.4807 1060.3072 1070.9730 1073.9409 1078.2129 1114.6523 1171.1325 1172.6457 1183.9487 1188.7891 1197.8558 1202.8896 1238.8525 1246.5810 1290.0630 1298.9889 1302.3602 1304.6364 1311.2227 1327.9008 1346.7855 1368.3780 1373.5571 1381.7940 1388.2700 1398.5609 1425.0996 1460.4318 1466.0862 1586.4917 1587.2232 2940.3523 2964.8552 2994.5171 3008.4919 3064.0302 3066.1908 3087.0722 3128.7429 3137.8655 3149.4521 3158.1081 3169.4098 3516.2199 3534.3860 3541.5215 3583.6870
redmass: 4.5322 6.1442 4.8968 6.1436 5.8361 3.5020 6.6498 3.8895 4.5343 4.0999 2.0376 2.5481 3.3944 4.0281 4.7168 5.4786 4.4521 5.4180 1.5328 4.8936 2.6038 2.1859 1.5881 3.6724 1.6260 2.4416 4.9434 4.8201 6.4324 4.4198 5.3715 6.6633 2.1941 3.0067 2.1047 2.4974 3.6845 1.2555 2.4321 1.5039 4.7279 2.7669 1.5455 3.7148 4.8915 1.3247 3.9515 3.4155 2.8267 2.4072 2.9278 2.0945 2.2647 2.0613 2.1121 1.1533 1.0567 1.1657 1.2647 1.3548 1.3598 1.2928 1.2665 1.3019 1.2969 1.2508 1.2545 1.2935 1.2677 1.3416 1.2020 8.5704 1.4401 1.4757 1.4218 2.0741 2.0855 1.0856 6.1819 6.0305 1.0816 1.0844 1.0686 1.0796 1.0879 1.0870 1.0997 1.0850 1.0884 1.0930 1.0968 1.1017 1.0653 1.0655 1.0653 1.0666
irintensity: 0.2329 0.9196 1.1480 2.0546 4.4257 5.2662 1.1726 6.1750 2.7137 1.0391 58.9919 51.1227 4.9494 66.9720 5.8994 15.9296 1.4616 28.6567 57.3917 14.7148 16.8186 30.2255 148.3823 18.3704 191.4330 42.2308 74.5033 11.1112 0.2575 66.2979 35.5083 1.2464 34.8082 19.1964 23.9795 37.0278 54.5597 3.6146 26.9360 8.6487 12.7432 141.0843 9.2393 27.0914 92.2507 1.7961 21.8034 12.8574 34.8688 34.0272 89.2441 13.8478 31.6836 10.3903 38.4443 38.7094 0.2896 1.3837 2.1006 20.0139 25.7322 31.5036 20.6810 21.1493 0.7627 3.1863 1.5915 25.7898 23.9087 0.5613 26.6334 0.9742 10.8112 14.4374 10.7353 10.2712 25.5416 4.7283 2.8406 5.2786 19.3140 42.7170 28.3710 26.5292 18.4961 6.1378 24.5414 0.1364 5.2547 16.0539 14.4945 19.8993 3.2722 11.1549 20.3705 13.1831
temp: 298.150 k
press: 1.00000 atm
elementType: 16 8 8 8 8 8 6 6 6 6 6 6 6 6 6 6 6 6 1 1 1 1 1 1 1 1 1 1 1 1 1 1 1 1
symmnumber: 1
zpe: 697803.6 jmol-1
zpe.correction: 0.265779 hartree
zpe.thermalcorrener: 0.284052 hartree
zpe.thermalcorrenthalpy: 0.284997 hartree
zpe.thermalcorrgfe: 0.218796 hartree
zpe.sumelectzpe: -1239.627031 hartree
zpe.sumelectthermal: -1239.608758 hartree
zpe.sumelectthermalent: -1239.607814 hartree
zpe.sumelectthermalfe: -1239.674015 hartree
dipole: 3.3342 -2.5249 2.1648
dipole: 4.7094
quadrupole: -122.7795 -112.6703 -110.7364
quadrupole: 1.5546 6.4540 -8.3139
quadrupole: -7.3841 2.7251 4.6590 1.5546 6.4540 -8.3139
hfenergy: -1239.8928108 hartree
pointgroup: C01 [X(C12H16O5S1)]
dipole: 1.2553071 -0.9727647 0.9543839 debye
polarizability: 212.8940919|2.5286129|159.4694621|13.2801352|-13.4382629|112.0781187 unknown
InChI: InChI=1S/C12H16O5S/c13-6-8-9(14)10(15)11(16)12(17-8)18-7-4-2-1-3-5-7/h1-5,8-16H,6H2
charge 0 multiplicity 1
34 atoms
S  0.431555 -1.479549 -0.794242
O  -0.619922 0.713578 0.68064
O  -4.271584 -1.045499 -0.44548
O  -3.411825 1.451701 0.855768
O  -2.135087 -2.726386 0.291928
O  0.395282 3.085181 -0.387017
C  -2.88445 -0.61235 -0.501613
C  -2.822021 0.927371 -0.380282
C  -2.051604 -1.295899 0.603738
C  -1.336745 1.332167 -0.487663
C  -0.599968 -0.743999 0.654969
C  -1.04918 2.831222 -0.371893
C  2.091466 -0.846279 -0.273752
C  2.943604 -1.68494 0.482973
C  2.518674 0.443962 -0.666926
C  4.227718 -1.225164 0.857814
C  3.804114 0.897501 -0.287724
C  4.657765 0.066926 0.475338
H  -2.427833 -0.895907 -1.477686
H  -3.425284 1.376729 -1.187544
H  -2.527101 -1.094386 1.588498
H  -0.879749 0.92751 -1.412502
H  -0.072811 -1.023953 1.581686
H  -1.524827 3.242247 0.540472
H  -1.455581 3.359432 -1.250412
H  -4.26761 -2.038298 -0.440879
H  -2.776707 1.26627 1.597018
H  -1.617427 -3.258481 0.945965
H  0.793019 2.53986 0.341363
H  2.607998 -2.688584 0.764925
H  1.863818 1.085029 -1.26557
H  4.88904 -1.875787 1.440604
H  4.134213 1.896535 -0.592816
H  5.653549 0.421337 0.764002
