program: Gaussian 09
title: 000117426
version: EM64L-G09RevD.01
frameworkgroup: C1[X(C14H22O7)]
method: RPBEPBE
basis: SDD
operation: Freq
keyword: #pfreq=noraman
keyword: PBEPBE/SDD
title: #p freq=noraman PBEPBE/SDD
converged: YES YES NO NO
title: Mulliken charges:
elementType: O O O O O O O C C C C C C C C C C C C C C H H H H H H H H H H H H H H H H H H H H H H
charge: -0.249664 -0.291290 -0.245655 -0.311961 -0.290672 -0.266671 -0.231472 -0.106415 -0.169000 -0.083339 -0.097151 -0.072972 0.364464 -0.369437 0.372879 -0.681300 -0.685480 -0.680349 -0.696208 0.317900 -0.761393 0.227319 0.259158 0.318588 0.255451 0.250271 0.248946 0.201463 0.221919 0.224120 0.242706 0.236427 0.221147 0.224885 0.221288 0.230922 0.219603 0.237854 0.220013 0.221321 0.257444 0.246906 0.247432
chargesum: 0.00000
title: Mulliken charges with hydrogens summed into heavy atoms:
elementType: O O O O O O O C C C C C C C C C C C C C C
charge: -0.249664 -0.291290 -0.245655 -0.311961 -0.290672 -0.266671 -0.231472 0.120904 0.090158 0.235249 0.158300 0.177300 0.364464 0.080972 0.372879 0.007445 -0.003021 -0.008536 -0.017021 0.317900 -0.009612
polarizability: 1.98827708e+02 -1.33199514e+01 1.64866094e+02 -2.20500795e+00 -3.28588940e+00 1.47171487e+02
1716.lowfreq: -0.0007 -0.0003 0.0000 3.6387 6.0502 7.0425 16.9234 21.9635 43.7097
frequency: 16.7730 21.8281 43.6686 45.7902 50.4911 55.2247 65.9431 70.1942 86.9648 126.7768 164.4941 172.3559 186.0417 190.7297 210.4021 216.4651 224.5972 242.0340 268.8384 303.3086 321.4992 332.8468 344.8810 355.1861 382.6143 395.4877 422.4866 446.5384 472.8946 499.8822 514.5335 554.7623 595.3771 610.9890 615.2597 635.6592 669.1408 722.2830 730.0458 736.6994 751.2583 752.2594 816.3447 831.2880 850.7882 878.2023 881.7120 903.4285 916.5970 922.2613 934.6318 937.4167 949.6404 977.7208 982.4633 983.2361 989.7786 995.4395 1013.7891 1023.1621 1040.2881 1042.8289 1068.2461 1080.0935 1137.5500 1139.0168 1153.2244 1181.3851 1188.3616 1207.8702 1210.3915 1222.0140 1241.7219 1248.7088 1253.2690 1259.9451 1266.6065 1270.3411 1295.5786 1299.4514 1322.0637 1326.2761 1331.2256 1376.2573 1376.5040 1378.4826 1383.3793 1390.2240 1390.6076 1448.0988 1450.7457 1451.3366 1453.2597 1453.4581 1454.8944 1466.4406 1468.1205 1471.6187 1474.4149 1479.7730 1668.8122 2975.5193 2987.5002 2994.3638 3001.1660 3004.6992 3005.0306 3006.0033 3045.0887 3050.9294 3090.6610 3094.6019 3099.0577 3099.7165 3100.7402 3105.6728 3108.3644 3108.8158 3112.5072 3116.9163 3117.5496 3118.9552 3141.6822
redmass: 3.9718 4.2975 1.6049 3.7492 2.3297 3.3692 3.3030 5.4442 4.8076 4.4683 1.0576 1.0658 2.5761 4.6183 1.7354 1.5670 1.7190 2.0140 3.9577 3.5257 3.2582 2.9856 3.1387 3.1186 2.9209 2.8999 4.1102 3.7101 3.5163 4.2401 4.4363 3.3467 5.7666 4.7276 5.0692 5.3187 3.7564 6.2875 6.1748 6.4490 4.6032 3.2926 5.6699 4.7408 4.2562 4.0352 3.2290 3.1620 1.6179 1.4807 2.1582 3.3087 2.9653 5.2309 1.3255 1.3463 4.2742 2.3265 3.6107 3.3717 3.7850 1.7021 2.0308 2.5777 1.9033 1.9045 2.0370 1.3112 3.2990 2.6172 2.4002 2.1273 2.5603 1.4405 1.8539 1.7492 1.3897 1.2590 1.2833 1.4549 1.1456 1.2733 1.4157 1.6428 1.2944 1.3308 1.2424 1.2441 1.2240 1.0504 1.0510 1.0502 1.0533 1.0506 1.0523 1.0571 1.0696 1.0505 1.0534 1.0782 10.0683 1.0690 1.0831 1.0360 1.0352 1.0356 1.0356 1.0381 1.0862 1.0877 1.0865 1.1000 1.0944 1.1002 1.1001 1.0898 1.0996 1.0996 1.1007 1.1002 1.1007 1.0971 1.1022
irintensity: 0.1566 0.4466 1.7622 0.0554 0.0368 2.3068 3.9437 0.5150 0.7456 4.0384 0.1795 0.0200 6.9612 2.8246 0.8278 1.7823 3.0325 4.2986 1.3608 0.9111 4.2799 0.2743 3.1062 5.5696 7.0549 6.9153 9.0308 1.4076 17.4419 8.7738 10.5061 1.1507 14.8128 11.8420 5.4546 5.7536 5.1217 18.8233 22.0808 11.7044 27.5710 59.2879 24.2423 39.0163 10.3614 19.6317 21.3501 97.5306 4.9886 2.2123 20.0294 178.7989 142.2578 59.6394 1.6617 0.2631 11.2100 146.3283 127.4019 37.7246 73.4065 14.2387 4.9798 14.8161 56.8855 77.9798 16.8376 18.4714 319.7315 80.0771 85.5057 24.2217 48.1484 7.2044 22.2689 29.1028 15.0929 0.7877 0.5414 8.7339 0.0756 3.1638 2.5726 9.6942 39.2280 38.7967 59.9798 31.5057 20.5582 1.3795 4.3955 1.8809 14.8688 6.8365 16.2167 3.9867 1.3775 20.0945 14.9078 6.3962 177.3363 42.6084 24.1892 19.5433 9.2498 12.6253 12.0397 1.4190 25.7510 25.7818 11.9629 34.2987 7.9993 1.8401 0.7741 23.2527 30.3350 30.4757 16.7057 30.9396 21.5232 17.6696 8.5649
temp: 298.150 k
press: 1.00000 atm
elementType: 8 8 8 8 8 8 8 6 6 6 6 6 6 6 6 6 6 6 6 6 6 1 1 1 1 1 1 1 1 1 1 1 1 1 1 1 1 1 1 1 1 1 1
symmnumber: 1
zpe: 913479.4 jmol-1
zpe.correction: 0.347926 hartree
zpe.thermalcorrener: 0.370490 hartree
zpe.thermalcorrenthalpy: 0.371434 hartree
zpe.thermalcorrgfe: 0.293698 hartree
zpe.sumelectzpe: -1071.576930 hartree
zpe.sumelectthermal: -1071.554367 hartree
zpe.sumelectthermalent: -1071.553423 hartree
zpe.sumelectthermalfe: -1071.631159 hartree
dipole: 0.4663 0.1840 -0.5030
dipole: 0.7102
quadrupole: -118.0657 -120.0184 -130.9505
quadrupole: -3.3501 1.3179 -15.7129
quadrupole: 4.9458 2.9931 -7.9390 -3.3501 1.3179 -15.7129
hfenergy: -1071.9248564 hartree
pointgroup: C01 [X(C14H22O7)]
dipole: 0.1963206 -0.0257256 0.1971317 debye
polarizability: 190.6307269|19.7156794|173.0800892|2.7338433|-2.7658112|147.1544722 unknown
InChI: InChI=1S/C14H22O7/c1-7(15)17-10-9(8-6-16-13(2,3)19-8)18-12-11(10)20-14(4,5)21-12/h8-12H,6H2,1-5H3
charge 0 multiplicity 1
43 atoms
O  0.731309 0.908613 1.428445
O  2.67709 0.394958 -1.007606
O  3.098259 1.445025 1.077668
O  -2.305227 -0.404122 -0.301861
O  0.297055 -2.019802 0.503557
O  -3.647263 1.117971 0.907358
O  -0.008027 -3.216276 -1.48603
C  -0.079768 0.41368 0.279044
C  2.149801 -0.489325 0.049225
C  0.68005 -0.812398 -0.268978
C  2.114726 0.410026 1.316227
C  -1.487614 0.141475 0.811358
C  3.278342 1.621679 -0.390242
C  -2.244983 1.414614 1.256056
C  -3.604934 0.346762 -0.352264
C  2.513377 2.851271 -0.887751
C  4.779067 1.656171 -0.675615
C  -3.590641 1.272295 -1.578143
C  -4.759405 -0.650945 -0.334082
C  -0.085425 -3.157834 -0.24314
C  -0.5970 -4.233666 0.685372
H  -0.115884 1.1885 -0.513469
H  2.774183 -1.392652 0.151258
H  0.510051 -0.994581 -1.341621
H  2.377345 -0.051799 2.278389
H  -1.437879 -0.607775 1.6201
H  -2.209107 1.590543 2.340151
H  -1.879896 2.314096 0.719667
H  2.970883 3.768696 -0.479685
H  2.546088 2.895364 -1.989926
H  1.46351 2.810464 -0.556268
H  5.252189 0.722007 -0.33187
H  4.95531 1.76868 -1.758833
H  5.244852 2.506204 -0.147982
H  -4.552929 1.806179 -1.663426
H  -3.427661 0.679174 -2.494251
H  -2.780078 2.017394 -1.499434
H  -4.686331 -1.28752 0.562164
H  -4.723898 -1.288831 -1.233289
H  -5.724071 -0.11519 -0.31403
H  -1.649986 -4.014713 0.941201
H  -0.02021 -4.25329 1.623455
H  -0.553773 -5.211123 0.182802
