program: Gaussian 09
title: 000117387
version: EM64L-G09RevD.01
frameworkgroup: C1[X(C14H17N3O3)]
method: RPBEPBE
basis: SDD
operation: Freq
keyword: #p
keyword: freq=noraman
keyword: PBEPBE/SDD
title: #p freq=noraman PBEPBE/SDD
converged: YES YES NO NO
title: Mulliken charges:
elementType: O O O N N N C C C C C C C C C C C C C C H H H H H H H H H H H H H H H H H
charge: -0.248079 -0.199818 -0.196938 -0.121473 -0.065599 0.019675 -0.127669 -0.133106 -0.438255 -0.422714 -0.415223 -0.397886 0.087497 -0.609781 0.226742 0.227049 -0.327871 -0.377599 -0.230316 -0.207448 0.281497 0.249868 0.213649 0.246269 0.243694 0.215366 0.225959 0.203499 0.189111 0.225430 0.191204 0.224471 0.222020 0.257069 0.285029 0.240882 0.243794
chargesum: 0.00000
title: Mulliken charges with hydrogens summed into heavy atoms:
elementType: O O O N N N C C C C C C C C C C C C C C
charge: -0.248079 -0.199818 -0.196938 -0.121473 -0.065599 0.019675 0.153828 0.116763 0.021663 0.036346 0.014234 0.016654 0.087497 0.027915 0.226742 0.227049 -0.070801 -0.092570 0.010566 0.036345
polarizability: 2.27806414e+02 7.31708281e+00 1.86205089e+02 -1.37658187e+01 -3.21587929e-01 1.31618687e+02
1716.lowfreq: -15.4031 -4.5609 -0.0007 -0.0002 0.0006 9.3207 25.5288 40.4145 51.5603
frequency: 24.3465 40.3551 51.4004 68.9352 76.4495 124.3444 134.8713 152.3426 169.2498 198.4885 219.5447 226.7267 263.4695 299.0507 329.1903 338.9725 347.3387 356.4230 395.3264 414.7003 421.4702 490.0828 522.5804 545.7683 587.1907 600.6107 639.6677 664.8986 678.8781 699.7522 744.9473 746.4888 760.0835 783.4367 788.1876 801.2153 830.7805 848.9428 887.5313 897.7117 908.3630 930.8085 972.1944 982.1916 992.2221 999.5806 1023.1279 1033.0000 1036.9209 1061.0908 1074.8968 1078.3879 1114.7735 1117.9763 1136.5617 1145.1739 1160.3942 1170.7980 1175.5715 1195.0529 1210.7902 1214.5109 1218.6255 1242.7309 1263.8584 1269.0827 1270.9263 1295.1535 1311.4715 1318.3835 1323.9521 1339.8014 1363.5338 1369.7162 1382.5905 1414.4303 1427.9407 1432.2715 1452.1813 1459.1153 1461.2532 1467.6888 1470.7352 1477.0007 1482.9634 1565.4220 1576.2856 1607.0122 2836.2676 2855.1779 2868.5753 3015.5472 3016.9194 3022.0018 3023.3970 3034.4768 3073.9097 3074.4797 3084.1420 3091.3887 3106.5675 3139.8003 3153.9107 3167.7903 3184.2088
redmass: 6.2385 4.4036 5.7705 5.5005 7.6220 4.0801 3.9528 5.5306 2.0041 3.6439 1.5520 2.3538 6.5790 3.5756 4.3294 2.3064 2.8995 2.2658 7.8323 3.9270 4.1417 3.7239 6.8834 4.1158 3.9739 3.9219 5.8947 5.8232 5.7116 8.2996 4.9701 4.2607 4.2578 1.7356 4.4268 1.5494 3.1623 2.5747 1.7941 2.3121 2.8167 1.7341 1.3919 1.7929 2.4573 1.3479 2.2990 2.5692 1.9658 3.5992 1.7821 1.5565 1.3280 2.2519 2.0112 1.9929 2.4605 1.2213 1.1184 1.2663 2.2219 2.5519 3.1051 1.5026 1.4808 1.4314 1.4880 1.4378 1.5489 1.6916 1.7038 1.3816 1.4739 9.1941 5.5184 4.0655 2.4640 1.1639 1.0831 1.0715 1.0718 2.7506 1.1003 1.1016 1.0549 11.1245 6.5892 7.1959 1.0699 1.0630 1.0638 1.0731 1.0863 1.0711 1.0777 1.0619 1.1004 1.0895 1.1019 1.0902 1.1060 1.0867 1.0914 1.0959 1.0979
irintensity: 0.7190 0.8618 1.1559 1.6012 0.9761 3.7019 3.3026 0.6428 1.3018 4.1757 0.8139 0.4943 0.4827 6.5883 15.4701 0.9657 1.5004 2.7231 2.7970 2.0025 2.8691 0.1808 1.0703 7.7764 6.3402 7.5430 2.8721 12.1699 26.2761 12.3106 0.4874 9.6201 6.3084 59.8412 22.7096 11.4637 24.5888 6.3593 4.1215 4.9154 1.9284 0.2530 3.0424 9.7725 5.5117 0.5333 56.5987 2.0422 0.1209 6.0457 7.4138 7.1079 2.6418 5.0601 4.7382 3.4578 51.3801 8.1763 2.9148 10.3188 3.8020 102.6347 134.4787 27.1444 0.3816 7.0207 8.8190 0.8154 1.4851 26.0641 15.6408 0.9618 14.4640 174.5390 2.0778 230.5913 3.3463 3.2394 2.7610 22.4661 9.4904 1.4676 20.9766 9.1301 10.0540 418.4946 37.1645 9.6187 77.6650 56.8404 200.6451 42.2543 28.0675 19.7779 48.8434 45.0469 17.4683 40.5942 0.1823 8.6911 43.0825 1.4450 10.0998 10.4715 8.0529
temp: 298.150 k
press: 1.00000 atm
elementType: 8 8 8 7 7 7 6 6 6 6 6 6 6 6 6 6 6 6 6 6 1 1 1 1 1 1 1 1 1 1 1 1 1 1 1 1 1
symmnumber: 1
zpe: 777087.1 jmol-1
zpe.correction: 0.295977 hartree
zpe.thermalcorrener: 0.313529 hartree
zpe.thermalcorrenthalpy: 0.314474 hartree
zpe.thermalcorrgfe: 0.249522 hartree
zpe.sumelectzpe: -932.041511 hartree
zpe.sumelectthermal: -932.023959 hartree
zpe.sumelectthermalent: -932.023014 hartree
zpe.sumelectthermalfe: -932.087966 hartree
dipole: -2.4217 5.7190 -2.9565
dipole: 6.8784
quadrupole: -106.5977 -115.4076 -124.3347
quadrupole: 13.0444 -6.1011 -0.2945
quadrupole: 8.8490 0.0391 -8.8880 13.0444 -6.1011 -0.2945
hfenergy: -932.337488 hartree
pointgroup: C01 [X(C14H17N3O3)]
dipole: 0.8862085 2.3978876 0.8877872 debye
polarizability: 227.6036374|-7.2648394|185.0181439|-15.4558734|-5.8381546|133.008409 unknown
InChI: InChI=1S/C14H17N3O3/c1-15-8-10-6-7-11(9-15)16(10)14(18)12-4-2-3-5-13(12)17(19)20/h2-5,10-11H,6-9H2,1H3
charge 0 multiplicity 1
37 atoms
O  -0.429733 -0.819019 -2.16692
O  -3.534618 -2.208138 0.882729
O  -1.272322 -2.171456 0.615033
N  0.969961 -0.205307 -0.403709
N  3.584267 0.736889 0.299224
N  -2.432004 -1.601531 0.600004
C  2.175221 -0.947736 -0.861485
C  1.276325 0.150835 1.006938
C  2.43053 -1.925452 0.327355
C  1.834763 -1.1908 1.577305
C  3.310933 0.092594 -1.009574
C  2.364894 1.252864 0.963886
C  -0.246732 -0.275472 -1.030599
C  4.677698 1.719927 0.247629
C  -1.404168 0.475401 -0.385318
C  -2.494221 -0.156051 0.266657
C  -1.510022 1.868925 -0.62042
C  -3.655753 0.547007 0.655769
C  -2.654613 2.59357 -0.222115
C  -3.733283 1.931733 0.411939
H  1.962282 -1.445926 -1.819915
H  0.378621 0.515179 1.531076
H  3.507962 -2.125328 0.448291
H  1.9064 -2.879009 0.145946
H  1.015505 -1.778662 2.023218
H  2.604519 -1.000222 2.343232
H  4.23674 -0.408083 -1.350842
H  3.012595 0.832164 -1.795401
H  1.938678 2.149153 0.441296
H  2.631058 1.55884 1.993703
H  4.447399 2.610448 -0.390638
H  5.589154 1.241557 -0.154291
H  4.903606 2.081556 1.267288
H  -0.692553 2.378112 -1.141509
H  -4.46712 -0.000208 1.14309
H  -2.709197 3.670202 -0.414901
H  -4.625171 2.489543 0.713927
