program: Gaussian 09
title: 000117339
version: EM64L-G09RevD.01
frameworkgroup: C1[X(C11H20O)]
method: RPBEPBE
basis: SDD
operation: Freq
keyword: #pfreq=noraman
keyword: PBEPBE/SDD
title: #p freq=noraman PBEPBE/SDD
converged: YES YES NO NO
title: Mulliken charges:
elementType: O C C C C C C C C C C C H H H H H H H H H H H H H H H H H H H H
charge: -0.307677 0.444654 -0.083824 -0.477674 -0.521511 -0.465640 -0.437340 -0.774335 0.488843 -0.831989 -0.531506 -0.736694 0.169650 0.218065 0.188043 0.201912 0.204732 0.194145 0.244076 0.204359 0.205647 0.210292 0.231957 0.216380 0.220438 0.225787 0.225638 0.202285 0.206043 0.231100 0.209952 0.224192
chargesum: 0.00000
title: Mulliken charges with hydrogens summed into heavy atoms:
elementType: O C C C C C C C C C C C
charge: -0.307677 0.444654 0.085826 -0.071566 -0.114866 -0.027419 -0.027335 -0.115706 0.488843 -0.160126 0.107922 -0.302549
polarizability: 1.35949948e+02 3.81511987e+00 1.23839410e+02 -2.66865752e+00 -2.02635511e+00 9.67374416e+01
1716.lowfreq: -19.2263 -6.4046 -0.0007 -0.0006 0.0005 22.2480 36.3865 62.3503 80.4499
frequency: 36.0562 62.1640 80.4056 153.2266 167.4796 176.1594 188.2703 195.4520 250.9085 259.4906 287.9390 317.1235 334.1210 379.9661 401.7730 429.4851 464.6007 486.6945 504.2404 533.5785 586.4133 668.9471 698.3681 772.7626 779.6826 840.8583 883.5810 893.7633 925.0526 925.6759 942.8933 982.5839 991.0457 997.1447 1019.8725 1025.8391 1041.4543 1060.1783 1085.2189 1112.6017 1128.9091 1137.9157 1140.0001 1157.4399 1186.2214 1224.2993 1260.8261 1267.8811 1277.3317 1287.9111 1314.8711 1328.7937 1331.2913 1355.8544 1369.9742 1376.8353 1394.5093 1424.4694 1431.5504 1446.8937 1451.3709 1455.4543 1463.9447 1465.1276 1468.8020 1476.9558 1477.5793 1481.1205 1484.4007 1663.7930 2912.0405 2936.6648 2964.5721 2971.2422 2976.1247 2981.4043 2984.0922 2996.4578 3012.3258 3024.6238 3037.6944 3043.0229 3044.6527 3062.5495 3071.6998 3081.4513 3083.2626 3089.1417 3096.0580 3196.0533
redmass: 2.4508 3.1587 2.0663 1.3099 2.3261 1.6061 2.1015 1.3922 1.8872 2.3393 2.1263 2.4994 2.2168 2.4559 2.1475 2.4722 2.6260 2.4928 3.0268 2.3417 2.7197 3.9202 1.1679 1.6477 2.1931 2.1574 2.6076 1.8819 1.4185 1.3378 1.8981 1.7292 1.7814 1.7645 1.9564 2.8442 1.7290 1.7909 1.6412 1.2733 1.9496 1.6729 2.1892 1.7277 1.6536 1.6091 1.7257 1.3386 1.8049 1.3166 1.4710 1.3774 1.5045 1.6837 1.5750 1.2493 1.2187 1.1866 1.1246 1.0805 1.0867 1.0728 1.0520 1.0573 1.0859 1.0693 1.0596 1.0592 1.0571 4.8850 1.0808 1.0336 1.0376 1.0583 1.0459 1.0528 1.0601 1.0614 1.1015 1.0981 1.0963 1.0993 1.1029 1.1021 1.0984 1.0997 1.0982 1.0976 1.0629 1.1128
irintensity: 0.2576 0.8002 4.5575 0.4607 0.4857 0.1511 0.5561 1.7793 5.9032 0.2282 0.3105 2.8728 1.9258 2.8392 2.0525 3.3075 1.4860 1.3828 0.3908 6.2699 0.5281 4.8186 0.3195 1.3945 2.5032 10.5108 3.1350 3.9493 24.7137 53.0138 3.9948 1.0590 3.5358 8.2228 20.7611 64.6264 1.4744 0.6900 0.8327 0.6959 28.8767 3.4683 12.2335 11.5527 4.3419 11.8413 8.7888 0.7529 1.8775 6.3414 7.5396 5.0249 3.5518 9.0482 7.4172 14.1716 23.9587 1.9217 2.9208 1.2218 8.0562 7.3175 9.9499 7.2154 11.6281 18.2541 22.7062 7.6112 7.2048 31.1044 31.3042 67.0733 32.2271 17.3491 7.4908 81.7184 23.1949 35.1643 75.8661 46.6627 17.1629 41.6385 27.1488 28.6082 57.8656 29.9831 33.5557 30.1246 10.6137 27.9857
temp: 298.150 k
press: 1.00000 atm
elementType: 8 6 6 6 6 6 6 6 6 6 6 6 1 1 1 1 1 1 1 1 1 1 1 1 1 1 1 1 1 1 1 1
symmnumber: 1
zpe: 749104.7 jmol-1
zpe.correction: 0.285319 hartree
zpe.thermalcorrener: 0.299092 hartree
zpe.thermalcorrenthalpy: 0.300036 hartree
zpe.thermalcorrgfe: 0.245530 hartree
zpe.sumelectzpe: -505.384095 hartree
zpe.sumelectthermal: -505.370322 hartree
zpe.sumelectthermalent: -505.369378 hartree
zpe.sumelectthermalfe: -505.423884 hartree
dipole: -0.9577 -0.3637 1.3199
dipole: 1.6708
quadrupole: -72.8109 -72.3523 -78.5642
quadrupole: -4.0319 -2.2843 -0.6532
quadrupole: 1.7649 2.2235 -3.9884 -4.0319 -2.2843 -0.6532
hfenergy: -505.6694143 hartree
pointgroup: C01 [X(C11H20O1)]
dipole: -0.3758665 0.1784093 -0.5089129 debye
polarizability: 135.9111625|-4.0372988|124.0258007|2.4200119|-0.2589154|96.589836 unknown
InChI: InChI=1S/C11H20O/c1-9(2)10-5-7-11(3,12-4)8-6-10/h10H,1,5-8H2,2-4H3
charge 0 multiplicity 1
32 atoms
O  -1.982975 -0.560516 0.917057
C  -1.74862 0.462064 -0.149643
C  1.266861 0.253345 -0.393568
C  -0.794757 1.466753 0.541257
C  -1.048427 -0.170354 -1.382135
C  0.580511 0.847933 0.876034
C  0.320992 -0.79304 -1.031215
C  -3.075813 1.143769 -0.541558
C  2.675513 -0.259536 -0.08185
C  3.72364 0.814843 0.169333
C  -2.848962 -1.684666 0.572717
C  3.00075 -1.579426 -0.025683
H  1.377938 1.091347 -1.121821
H  -1.282364 1.829089 1.465786
H  -0.661564 2.338721 -0.130859
H  -0.912509 0.626316 -2.142182
H  -1.708687 -0.930077 -1.845207
H  1.224906 1.618604 1.340138
H  0.442881 0.037719 1.615289
H  0.163284 -1.623495 -0.315518
H  0.785356 -1.222765 -1.939837
H  -3.755701 0.452597 -1.073042
H  -3.593229 1.518987 0.359776
H  -2.883832 2.000955 -1.21274
H  3.824334 1.478619 -0.712361
H  3.446254 1.461693 1.02407
H  4.713106 0.376097 0.383863
H  -2.444182 -2.293842 -0.262144
H  -3.879034 -1.363308 0.315259
H  -2.888546 -2.309166 1.480347
H  4.021123 -1.903968 0.211453
H  2.269854 -2.372392 -0.213913
