program: Gaussian 09
title: 000117326
version: EM64L-G09RevD.01
frameworkgroup: C1[X(C5H13NO)]
method: RPBEPBE
basis: SDD
operation: Freq
keyword: #p
keyword: freq=noraman
keyword: PBEPBE/SDD
title: #p freq=noraman PBEPBE/SDD
converged: YES YES NO NO
title: Mulliken charges:
elementType: O N C C C C C H H H H H H H H H H H H H
charge: -0.447258 -0.579117 0.259660 -0.395183 -0.368007 -0.718707 -0.718340 0.211464 0.199781 0.191196 0.212242 0.215226 0.204167 0.212006 0.223136 0.214063 0.193914 0.263982 0.294514 0.331262
chargesum: 0.00000
title: Mulliken charges with hydrogens summed into heavy atoms:
elementType: O N C C C C C
charge: -0.115996 -0.020622 0.259660 0.016062 0.035431 -0.087308 -0.087227
polarizability: 6.59119585e+01 1.01651617e+00 6.60959116e+01 -3.31418557e+00 8.03142346e-01 6.20666255e+01
1716.lowfreq: -27.9480 -13.0582 -0.0004 0.0005 0.0006 10.9750 30.5606 141.4571 196.9063
frequency: 18.0919 141.2530 196.8178 207.5824 228.8848 265.7199 290.0064 321.7554 325.2016 351.6554 369.6224 445.9134 501.6622 535.0311 739.6329 822.7775 872.4166 902.3085 931.8984 942.8596 993.5617 997.7384 1082.6743 1117.2241 1131.3454 1206.7806 1238.6614 1253.1664 1315.6264 1336.6083 1350.4442 1367.2624 1372.2822 1394.3404 1448.0364 1457.4878 1466.1228 1469.9627 1481.5833 1489.9515 1629.1444 2946.3727 2955.8740 2963.8315 2974.9288 3040.5493 3046.8345 3053.3647 3060.0062 3064.8276 3066.4754 3490.3068 3567.7905 3624.5494
redmass: 2.7816 2.0171 1.2655 2.2241 1.0295 1.8869 1.4771 1.3998 1.8560 1.7094 2.2413 1.3361 2.4997 2.9794 3.3658 1.3902 2.1149 1.8107 1.4347 1.6858 3.1488 1.2875 1.4467 3.5819 1.3113 2.7273 2.0014 2.4519 1.2912 1.2423 1.2652 1.2377 1.2079 1.2155 1.0835 1.0694 1.0529 1.0549 1.0564 1.0599 1.0944 1.0673 1.0366 1.0367 1.0624 1.0986 1.0985 1.0981 1.0976 1.0973 1.0987 1.0439 1.0659 1.1000
irintensity: 2.0496 2.5764 1.1488 3.0054 4.9463 35.1665 33.3176 61.3543 59.5268 18.2617 44.1096 245.5407 76.2318 49.3251 8.9717 3.6963 30.0546 7.6255 8.3233 36.1260 51.1992 6.1385 8.0764 22.2549 19.0181 1.0731 8.5586 4.0859 7.5209 2.1253 0.8979 6.4264 27.5768 22.1871 3.1211 3.7216 1.1137 9.2793 12.4638 26.0262 35.2961 66.0781 38.3007 40.2731 43.4920 2.2247 68.7913 20.8280 12.4338 47.0322 67.9943 2.1251 3.2426 3.3009
temp: 298.150 k
press: 1.00000 atm
elementType: 8 7 6 6 6 6 6 1 1 1 1 1 1 1 1 1 1 1 1 1
symmnumber: 1
zpe: 465746.9 jmol-1
zpe.correction: 0.177394 hartree
zpe.thermalcorrener: 0.187148 hartree
zpe.thermalcorrenthalpy: 0.188093 hartree
zpe.thermalcorrgfe: 0.142947 hartree
zpe.sumelectzpe: -327.677126 hartree
zpe.sumelectthermal: -327.667372 hartree
zpe.sumelectthermalent: -327.666427 hartree
zpe.sumelectthermalfe: -327.711573 hartree
dipole: 1.3533 1.9396 0.5815
dipole: 2.4355
quadrupole: -45.7398 -49.6022 -44.4108
quadrupole: -0.9090 -5.2633 0.4468
quadrupole: 0.8444 -3.0179 2.1735 -0.9090 -5.2633 0.4468
hfenergy: -327.8545198 hartree
pointgroup: C01 [X(C5H13N1O1)]
dipole: -0.2997836 0.8936248 -0.1724657 debye
dipolederiv: -0.6131451 -0.3266076 -0.0914953 -0.303188 -0.5710954 0.177259 -0.1060912 0.1934469 -0.4371776 -0.742054 0.4517895 -0.143968 0.4353169 -0.57379 0.0330651 -0.2149056 0.0591908 -0.4897567 -0.0603763 0.0501807 -0.0384545 0.041694 -0.0626813 0.0206568 -0.0968552 0.0181055 -0.0015218 0.4296691 -0.2400047 0.0122599 -0.2506907 0.4020412 0.0490847 -0.0101777 0.1027796 0.2943418 0.4061177 0.1865999 -0.0422927 0.1522508 0.4395787 -0.1440353 0.0098855 -0.1422492 0.3419757 -0.0055291 -0.0301489 0.0413939 -0.0426732 -0.0159577 0.0584047 0.0171061 0.0169514 0.006764 -0.0174379 0.0255154 0.0515103 0.0290976 0.0072876 -0.0666181 0.0098636 -0.0485408 -0.0115105 0.0011985 -0.0140536 0.1227337 -0.011743 -0.0031472 0.1032429 0.0764622 0.0782617 -0.0641901 -0.0485874 -0.0680124 -0.0863202 -0.0682968 -0.0855022 -0.1243178 -0.0682038 -0.0767369 0.0116752 -0.1078516 0.0713119 -0.1056119 0.0826312 -0.0828908 0.1324158 -0.0631796 0.0816089 -0.0079311 0.0392917 0.0237915 0.1398807 0.0182815 -0.0067164 -0.0846885 0.0888273 -0.048734 -0.0552153 0.0013026 -0.1161005 -0.0538273 -0.1054026 -0.0347964 -0.0510043 -0.0836852 -0.1044343 0.011082 -0.0125026 0.0383277 0.1286171 0.0803188 0.0433819 -0.1148741 0.1179275 -0.0585691 -0.0372477 -0.0377995 0.1200092 -0.1153829 0.0740906 0.0107412 0.0831663 -0.0722381 0.088019 0.0079857 0.0034043 -0.1137016 -0.1052468 -0.0708285 -0.0021753 -0.0976816 -0.0535147 -0.0852638 0.0078452 -0.0599027 0.130182 -0.0466211 0.1229101 -0.0094056 0.0376084 -0.0891857 0.0771355 0.0256969 0.0066096 -0.0620581 0.1010039 -0.1049786 -0.0334268 0.1376794 0.103342 0.0884431 -0.0244187 0.3145843 -0.0906902 0.0886383 -0.1158559 0.1432001 0.0314662 0.2120511 -0.0220709 0.0892916 0.2024155 -0.1623875 0.0212075 -0.1082344 0.2171901 -0.0853792 0.0673003 -0.1698815 0.1764182 0.300593 0.1260573 0.1219752 0.1453003 0.2181642 -0.0954506 0.1552712 -0.0474618 0.1558932 unknown
polarizability: 64.9663563|-0.6206773|66.6165876|-3.6000648|0.4263212|62.4915517 unknown
InChI: InChI=1S/C5H13NO/c1-5(2,3-6)4-7/h7H,3-4,6H2,1-2H3
charge 0 multiplicity 1
20 atoms
O  -1.554459 -1.493164 -0.118108
N  1.813902 -1.226821 -0.046042
C  -0.068346 0.560542 -0.008474
C  1.014964 -0.291401 0.750071
C  -0.972502 -0.365204 -0.864872
C  0.612875 1.567807 -0.967947
C  -0.913161 1.325606 1.04191
H  0.504198 -0.878932 1.535578
H  1.697456 0.41323 1.267835
H  -1.770975 0.239061 -1.349433
H  -0.374024 -0.847661 -1.656757
H  1.229431 2.292248 -0.403623
H  1.271194 1.047479 -1.690516
H  -0.133765 2.142308 -1.549847
H  -0.269369 1.978002 1.661288
H  -1.676808 1.96502 0.559147
H  -1.430552 0.634372 1.738087
H  2.442038 -0.82133 -0.741859
H  1.314435 -2.058493 -0.366776
H  -2.138532 -1.13677 0.597239
