program: Gaussian 09
title: 000117287
version: EM64L-G09RevD.01
frameworkgroup: C1[X(C11H18O)]
method: RPBEPBE
basis: SDD
operation: Freq
keyword: #pfreq=noraman
keyword: PBEPBE/SDD
title: #p freq=noraman PBEPBE/SDD
converged: YES YES NO NO
title: Mulliken charges:
elementType: O C C C C C C C C C C C H H H H H H H H H H H H H H H H H H
charge: -0.216813 0.334612 -0.179772 -0.134232 -0.487164 -0.782488 -0.765748 -0.209538 -0.223384 0.163996 -0.747107 -0.809332 0.210119 0.259598 0.212675 0.212716 0.230432 0.218163 0.205406 0.199177 0.260725 0.235555 0.205497 0.200859 0.212634 0.231397 0.217079 0.241197 0.250087 0.253658
chargesum: 0.00000
title: Mulliken charges with hydrogens summed into heavy atoms:
elementType: O C C C C C C C C C C C
charge: -0.216813 0.334612 0.030347 0.125366 -0.061773 -0.128487 -0.070292 -0.004041 -0.022525 0.163996 -0.085998 -0.064391
polarizability: 1.25232735e+02 -4.51182338e+00 1.21156316e+02 -1.19476093e+00 4.60229793e+00 1.00384026e+02
1716.lowfreq: -0.0007 -0.0006 -0.0006 2.3621 7.5276 22.7779 66.4301 83.5063 128.3304
frequency: 66.2781 83.4849 128.3228 138.2357 164.9203 196.5399 228.0830 235.5552 247.8043 279.0542 290.1782 303.7493 316.0115 351.8840 380.1552 413.6691 460.3868 480.9525 519.1594 576.9274 586.0191 693.3496 723.5902 768.5973 844.3148 880.6529 882.5121 916.8854 940.3638 944.7883 963.3123 965.0661 971.9062 1004.8650 1012.0661 1027.0075 1063.7125 1072.2640 1115.8785 1140.9886 1161.4982 1172.9345 1201.6675 1218.8400 1243.4536 1270.5998 1296.2209 1315.1667 1322.0688 1334.9929 1367.9393 1372.1424 1383.3074 1388.8339 1402.4749 1441.9875 1447.7056 1452.0327 1468.2258 1471.8659 1474.5937 1481.9074 1486.2217 1494.5376 1618.9459 1671.5684 2942.1508 2957.4529 2962.7359 2971.0100 2973.3896 2977.6517 2982.1041 2994.2868 3055.2091 3061.9916 3065.8440 3067.4283 3071.5802 3072.6062 3084.6854 3094.4505 3117.8490 3119.2495
redmass: 3.7600 3.3282 2.4017 1.1048 3.5631 2.9345 1.1381 1.5158 1.5856 1.1124 2.7464 2.4333 2.3804 2.7259 2.5344 2.3368 3.3027 3.1372 2.6767 2.6803 3.8184 1.5172 3.0456 3.4231 2.0007 2.0069 2.4321 3.1549 1.4325 1.7916 1.7744 1.6093 1.3171 1.7026 1.3637 1.8555 2.0748 2.1813 1.6330 1.6331 1.7921 1.7566 2.0718 1.4349 1.8838 1.7756 1.3359 1.5243 1.6718 1.6284 1.2503 1.5113 1.2036 1.2823 1.2039 1.0740 1.0846 1.0537 1.0522 1.0557 1.0555 1.0463 1.0531 1.0521 6.9994 7.0989 1.0621 1.0795 1.0371 1.0467 1.0644 1.0425 1.0397 1.0960 1.0987 1.0954 1.0986 1.0994 1.0975 1.0996 1.0840 1.0997 1.1009 1.0987
irintensity: 3.8039 2.9444 0.6449 0.3828 0.4824 3.8495 0.1072 0.4698 0.3005 0.1792 0.4958 0.8671 0.2643 0.3377 0.2755 0.3596 1.6163 2.6797 3.0309 0.3403 10.4173 34.7926 9.1059 1.3325 4.1025 2.0020 0.4732 3.6583 0.6599 0.5174 7.4805 3.9320 1.2201 13.5526 1.9380 2.8312 1.8000 0.1796 5.2131 3.5166 11.5395 46.9970 13.7848 17.5523 18.2293 17.6579 0.0473 5.6539 3.3602 38.8868 65.4716 5.1099 28.5940 10.3295 25.8748 16.3063 6.7982 12.5813 4.9345 5.8013 7.3870 13.9243 10.5102 8.8504 82.7043 4.1985 35.6121 1.5156 32.3510 21.0690 38.3364 20.8742 12.9419 33.4424 39.5013 13.3436 23.2760 32.6955 35.4577 32.8754 9.9407 17.2752 23.1667 55.2372
temp: 298.150 k
press: 1.00000 atm
elementType: 8 6 6 6 6 6 6 6 6 6 6 6 1 1 1 1 1 1 1 1 1 1 1 1 1 1 1 1 1 1
symmnumber: 1
zpe: 687331.8 jmol-1
zpe.correction: 0.261791 hartree
zpe.thermalcorrener: 0.275159 hartree
zpe.thermalcorrenthalpy: 0.276103 hartree
zpe.thermalcorrgfe: 0.223473 hartree
zpe.sumelectzpe: -504.226667 hartree
zpe.sumelectthermal: -504.213299 hartree
zpe.sumelectthermalent: -504.212355 hartree
zpe.sumelectthermalfe: -504.264985 hartree
dipole: 1.0031 -0.4034 -2.6536
dipole: 2.8654
quadrupole: -75.4432 -71.7179 -78.4091
quadrupole: -0.2071 6.0686 0.7283
quadrupole: -0.2531 3.4722 -3.2190 -0.2071 6.0686 0.7283
hfenergy: -504.4884579 hartree
pointgroup: C01 [X(C11H18O1)]
dipole: 0.4382124 0.1188726 1.0318693 debye
polarizability: 124.5653085|5.0315536|121.1612304|-0.1346437|5.8026627|101.0465383 unknown
InChI: InChI=1S/C11H18O/c1-8-6-5-7-11(3,4)10(8)9(2)12/h5-6,8,10H,7H2,1-4H3
charge 0 multiplicity 1
30 atoms
O  -2.21702 -0.198585 -1.190033
C  0.409494 1.172769 0.069505
C  -0.318717 -0.207228 0.35264
C  0.372148 -1.390029 -0.392185
C  1.855605 1.050238 0.637107
C  -0.317038 2.330641 0.801321
C  0.470099 1.48898 -1.448837
C  1.879763 -1.327281 -0.222612
C  2.546672 -0.244848 0.255248
C  -1.814361 -0.155639 0.006859
C  -0.170881 -2.759582 0.094491
C  -2.801566 -0.078602 1.164762
H  -0.226982 -0.387913 1.444897
H  0.115264 -1.296855 -1.468871
H  1.835887 1.148393 1.744585
H  2.451225 1.911682 0.270082
H  -1.309452 2.535297 0.358552
H  0.277181 3.260751 0.723308
H  -0.452676 2.110322 1.878232
H  0.872595 2.508672 -1.6001
H  -0.529957 1.437181 -1.911991
H  1.13112 0.783994 -1.982166
H  2.438308 -2.234676 -0.495583
H  3.637984 -0.288231 0.377044
H  0.004576 -2.892253 1.179045
H  -1.254588 -2.854477 -0.101692
H  0.335297 -3.58982 -0.431978
H  -2.746214 -1.012935 1.757866
H  -2.54071 0.748237 1.850171
H  -3.828856 0.052097 0.789535
