program: Gaussian 09
title: 000117244
version: EM64L-G09RevD.01
frameworkgroup: C1[X(C18H20N2O4)]
method: RPBEPBE
basis: SDD
operation: Freq
keyword: #p
keyword: freq=noraman
keyword: PBEPBE/SDD
title: #p freq=noraman PBEPBE/SDD
converged: YES YES NO NO
title: Mulliken charges:
elementType: O O O O N N C C C C C C C C C C C C C C C C C C H H H H H H H H H H H H H H H H H H H H
charge: -0.336278 -0.308036 -0.266079 -0.283012 -0.462984 -0.617338 0.105124 -0.339983 0.504909 -0.285569 -0.726218 -0.418501 -0.396572 -0.248817 -0.259751 -0.244084 0.252612 0.299547 0.486326 -0.447121 -0.356017 -0.195713 -0.211827 -0.257131 0.236857 0.258106 0.228118 0.246880 0.215632 0.236702 0.229177 0.245267 0.222929 0.225915 0.225829 0.230094 0.327931 0.340186 0.337378 0.223382 0.299406 0.227035 0.226494 0.229195
chargesum: 0.00000
title: Mulliken charges with hydrogens summed into heavy atoms:
elementType: O O O O N N C C C C C C C C C C C C C C C C C C
charge: -0.336278 -0.308036 -0.266079 -0.283012 -0.135054 0.060227 0.105124 0.154981 0.504909 0.189429 -0.044707 -0.173234 -0.173643 -0.022902 -0.033923 -0.013989 0.252612 0.299547 0.486326 -0.223739 -0.056611 0.031322 0.014667 -0.027936
polarizability: 3.09115515e+02 -1.96060659e+01 1.69823176e+02 -1.53665246e+00 3.70863954e+01 1.88258238e+02
1716.lowfreq: -5.0795 -0.0009 -0.0005 0.0004 2.6382 4.9013 10.0569 15.6971 25.3874
frequency: -4.3741 15.3381 25.3116 37.9179 40.0443 42.2978 61.4049 75.4695 105.3830 123.6311 133.2450 150.4317 168.6445 198.3778 210.7925 231.4589 247.7200 254.4365 278.3990 292.7560 329.3831 338.1872 383.6578 403.8089 407.9391 410.8312 448.4475 493.2860 493.3642 508.8954 515.1869 560.6581 573.6695 597.8403 614.1850 617.6799 624.1012 638.4910 695.9378 698.2782 699.6027 703.6264 705.3673 754.3860 766.5684 771.8251 824.7474 841.7943 842.1698 848.6151 868.5067 908.4981 914.4212 915.1356 922.9194 963.1113 972.4089 974.2529 984.4999 990.7771 994.5533 996.7481 1002.8546 1011.1336 1022.5573 1028.3610 1034.5771 1057.6681 1086.1957 1088.1925 1090.8740 1148.9650 1160.6181 1172.9854 1174.6075 1190.3523 1190.5043 1204.6937 1222.1793 1258.4726 1264.9362 1271.7416 1297.9110 1325.6907 1329.9728 1358.8906 1370.5929 1377.9963 1386.4809 1396.9058 1433.8593 1435.1207 1466.6664 1469.3912 1480.3879 1481.7298 1486.5119 1491.3776 1518.7615 1587.9354 1591.3778 1601.6892 1614.4611 1617.7348 1665.6029 1685.3693 2992.8272 3014.0046 3020.2981 3085.5054 3088.0007 3090.8649 3098.5615 3113.7538 3117.2674 3127.1801 3132.6705 3140.0991 3144.9020 3153.7705 3165.8136 3166.2216 3189.4071 3543.0266 3559.1521 3717.5540
redmass: 9.6073 5.0887 5.0477 4.2475 4.5517 5.3305 6.5746 5.6154 4.9013 5.3523 5.0029 5.5338 4.4275 2.6211 1.5118 3.1544 4.4988 3.9683 3.1369 3.4034 2.3710 6.6084 5.4243 2.8063 2.9225 3.1965 3.6598 1.7611 1.6512 2.8012 1.0598 3.1331 4.2264 6.2362 6.3321 6.3991 5.4062 1.2767 2.3380 5.6658 5.4254 3.2733 2.4950 3.7363 1.6591 2.0532 5.2041 4.4449 1.2928 1.2548 2.5567 1.9874 1.4334 1.4531 4.7897 1.6029 1.3546 1.3991 6.1471 6.0450 1.3148 1.3042 1.9941 3.9549 5.8738 2.3773 2.6714 2.0162 1.7395 1.9801 1.5785 2.6586 3.3035 1.0508 1.0540 1.1186 1.3819 1.1378 2.5082 2.0986 1.5245 1.5221 2.3805 1.4010 1.3618 1.4877 1.5773 6.4679 5.7830 1.2773 2.3284 2.2531 1.0880 1.1141 1.1042 1.1368 2.1524 1.7840 2.1384 1.2190 5.7893 5.2547 6.0083 6.0314 8.8664 7.3947 1.0352 1.0571 1.0574 1.1058 1.1056 1.1023 1.1003 1.0884 1.0861 1.0866 1.0869 1.0927 1.0935 1.0948 1.0996 1.1005 1.0953 1.0760 1.0445 1.1058
irintensity: 1.3044 1.2244 1.8466 0.4332 3.0983 0.6962 2.0217 1.6539 2.0925 2.0091 5.3921 2.5019 0.7852 2.7793 1.7796 6.3477 5.5212 10.7377 2.5933 15.1289 3.6789 1.9849 1.1510 0.0215 0.0041 2.3131 5.2707 112.9702 181.7794 25.6039 25.8947 14.2873 3.5922 1.6133 1.3960 0.7500 2.2603 29.0285 10.0699 26.0569 37.5246 59.6905 40.5537 7.7116 103.7769 38.8031 3.0770 28.2328 1.8750 0.0932 22.0496 7.1473 11.6170 3.0961 6.6901 9.4454 0.0699 0.8869 6.9418 0.3834 0.0748 2.1267 61.7386 311.1618 169.1554 15.9670 61.0312 20.5716 5.7828 22.1541 28.0801 24.3171 516.1236 0.7171 0.1836 5.9451 1.0612 0.1765 9.5924 5.1786 14.3335 19.7984 368.0209 57.7726 2.0365 12.2065 88.8433 6.1378 63.2703 10.5610 139.1858 8.1620 2.8354 1.4136 12.1257 31.1118 17.7455 71.6192 531.5998 104.8446 1.5791 33.0167 9.8798 105.3816 176.8805 370.8066 19.4875 26.2088 17.2876 11.6658 16.5542 28.7576 47.2731 13.9446 7.6635 0.0203 0.7285 26.5958 30.1040 43.9955 24.8332 12.6247 6.5406 24.7357 55.1257 49.2810
temp: 298.150 k
press: 1.00000 atm
elementType: 8 8 8 8 7 7 6 6 6 6 6 6 6 6 6 6 6 6 6 6 6 6 6 6 1 1 1 1 1 1 1 1 1 1 1 1 1 1 1 1 1 1 1 1
symmnumber: 1
zpe: 921287.2 jmol-1
zpe.correction: 0.350900 hartree
zpe.thermalcorrener: 0.373001 hartree
zpe.thermalcorrenthalpy: 0.373945 hartree
zpe.thermalcorrgfe: 0.296929 hartree
zpe.sumelectzpe: -1106.596471 hartree
zpe.sumelectthermal: -1106.574370 hartree
zpe.sumelectthermalent: -1106.573425 hartree
zpe.sumelectthermalfe: -1106.650441 hartree
dipole: 0.7947 0.0199 -0.3016
dipole: 0.8503
quadrupole: -123.1098 -148.7463 -128.4640
quadrupole: -7.0008 -8.8409 -6.5200
quadrupole: 10.3302 -15.3062 4.9760 -7.0008 -8.8409 -6.5200
hfenergy: -1106.9473704 hartree
pointgroup: C01 [X(C18H20N2O4)]
dipole: -0.3129537 -0.0082356 -0.1178939 debye
polarizability: 309.1672568|-19.5373215|169.7444127|1.290174|-37.0280725|188.2852596 unknown
InChI: InChI=1S/C18H20N2O4/c1-18(12-23-16(19)21,14-8-4-2-5-9-14)13-24-17(22)20-15-10-6-3-7-11-15/h2-11,20H,12-13,19H2,1H3
charge 0 multiplicity 1
44 atoms
O  0.594896 0.302657 0.569364
O  -1.947307 -1.718728 -0.439137
O  1.793415 1.397625 -1.138192
O  -1.858714 -3.90927 0.428802
N  2.837755 0.054889 0.519891
N  -2.108111 -3.477488 -1.868573
C  -1.830705 0.349426 0.8638
C  -0.660367 0.824644 -0.025819
C  -3.179553 0.853572 0.295031
C  -1.819105 -1.197227 0.941325
C  -1.633337 0.892595 2.310677
C  -3.273662 1.653274 -0.872824
C  -4.384918 0.524021 0.971205
C  -4.52597 2.109386 -1.34606
C  -5.636468 0.973792 0.501578
C  -5.714193 1.772837 -0.662739
C  1.770936 0.658483 -0.123285
C  -1.962925 -3.122531 -0.545104
C  4.218869 0.141739 0.188463
C  5.130339 -0.582834 1.002611
C  4.703708 0.911156 -0.902087
C  6.512591 -0.539401 0.730988
C  6.091331 0.943214 -1.159361
C  7.00386 0.225031 -0.353063
H  -0.59941 1.927212 -0.06046
H  -0.74572 0.430593 -1.052608
H  -2.657683 -1.579532 1.549489
H  -0.872203 -1.560106 1.376401
H  -2.426184 0.529686 2.987776
H  -0.656145 0.577343 2.714765
H  -1.672238 1.996264 2.311227
H  -2.376249 1.931848 -1.433688
H  -4.353638 -0.093098 1.877196
H  -4.569432 2.727412 -2.250156
H  -6.549454 0.70209 1.04343
H  -6.684502 2.125848 -1.029183
H  2.584713 -0.523887 1.323697
H  -2.134814 -4.464254 -2.107629
H  -2.203706 -2.764154 -2.587098
H  4.756948 -1.179284 1.845054
H  4.000756 1.465791 -1.526843
H  7.204301 -1.10339 1.366389
H  6.459767 1.538689 -2.002304
H  8.077727 0.258967 -0.564446
