program: Gaussian 09
title: 000117230
version: EM64L-G09RevD.01
frameworkgroup: C1[X(C12H24O2)]
method: RPBEPBE
basis: SDD
operation: Freq
keyword: #pfreq=noraman
keyword: PBEPBE/SDD
title: #p freq=noraman PBEPBE/SDD
converged: YES YES NO NO
title: Mulliken charges:
elementType: O O C C C C C C C C C C C C H H H H H H H H H H H H H H H H H H H H H H H H
charge: -0.270750 -0.242564 -0.018062 -0.425798 -0.407936 -0.365225 -0.340295 -0.354235 -0.719720 -0.697491 0.258880 -0.491571 -0.344763 -0.684381 0.208798 0.188353 0.201033 0.222819 0.207449 0.190042 0.202606 0.226173 0.228230 0.194491 0.195677 0.218293 0.217082 0.220261 0.210417 0.209926 0.216919 0.236113 0.236575 0.217800 0.216200 0.222955 0.207905 0.207793
chargesum: 0.00000
title: Mulliken charges with hydrogens summed into heavy atoms:
elementType: O O C C C C C C C C C C C C
charge: -0.270750 -0.242564 0.190736 -0.036411 0.022332 0.027423 0.114108 0.035932 -0.064084 -0.060229 0.258880 -0.018883 0.089237 -0.045728
polarizability: 1.77885958e+02 1.34270442e+00 1.19358471e+02 5.90422965e-01 -4.05474236e+00 1.17583863e+02
1716.lowfreq: -26.7969 -12.1774 -0.8616 -0.0005 0.0005 0.0009 7.7504 24.0351 26.3230
frequency: -11.6468 21.4969 25.8068 44.4516 53.9357 66.8387 73.6830 110.8803 120.5346 137.7604 176.7053 185.4422 204.2000 229.3433 230.8651 242.7611 258.8890 280.9984 305.0657 333.3724 401.4495 468.2848 490.5180 537.1453 546.4553 675.9400 728.6792 735.1697 760.1500 772.2836 805.5610 866.7789 868.4041 881.7890 894.6825 912.7149 950.5662 960.0724 976.4403 998.8491 1024.9401 1038.9263 1053.0135 1077.6018 1092.1431 1098.0887 1108.2666 1128.9738 1138.1319 1153.9738 1163.3962 1200.2657 1212.8189 1217.4340 1250.1093 1268.5452 1280.5821 1283.6553 1285.9157 1291.3484 1299.1035 1327.2394 1342.4469 1352.1669 1357.4304 1360.2249 1373.0037 1389.6224 1390.2441 1392.6990 1440.4375 1458.5404 1465.2290 1472.3086 1472.8317 1475.3240 1477.7593 1478.7663 1478.8828 1485.1610 1485.6458 1488.3203 1491.0387 1639.9577 2955.3539 2959.2295 2966.7808 2968.7866 2972.5985 2973.3518 2979.2202 2986.2102 2992.2660 2998.0016 3000.6858 3004.6095 3010.1046 3028.7159 3035.8410 3038.5053 3050.2633 3063.5295 3069.1919 3071.8465 3072.5388 3075.0786 3076.4310 3077.7405
redmass: 1.9337 2.7373 6.4894 3.3799 3.0128 1.7525 2.4487 3.4936 2.4023 1.9707 2.2842 3.6681 3.5791 1.1201 1.0748 1.3880 2.4513 3.0528 2.4402 3.6042 3.2738 3.0159 2.7084 2.4444 2.6318 5.2881 1.1010 1.1759 1.4075 1.5708 1.4020 1.3497 5.1324 2.2481 1.9599 1.3086 3.0109 1.6792 2.1366 1.9338 1.3982 2.5938 2.3911 2.4023 2.0752 1.5561 3.0185 1.7980 2.6986 2.1664 2.3198 1.1884 1.4304 1.3437 1.2601 1.1985 1.1805 1.0941 1.4236 1.0826 1.2800 1.4633 1.4499 1.4169 1.5277 1.6456 1.5899 1.2242 1.2178 1.2163 1.0861 1.0717 1.0716 1.0664 1.0607 1.0601 1.0426 1.0423 1.0735 1.0696 1.0766 1.0491 1.0784 9.8554 1.0591 1.0594 1.0796 1.0607 1.0363 1.0361 1.0363 1.0609 1.0769 1.0829 1.0578 1.0608 1.1009 1.0980 1.1037 1.1000 1.1005 1.1064 1.1007 1.0993 1.0991 1.1003 1.0988 1.1022
irintensity: 0.0066 0.1948 1.2793 0.1728 0.0990 0.0270 0.0451 0.4714 0.7786 0.4790 4.5635 3.0260 0.1460 0.0095 0.0328 1.3570 1.8625 10.1211 0.9656 3.6333 0.1468 0.2867 4.4222 3.8247 0.6307 3.4059 8.9855 13.4161 9.0277 10.4863 3.5180 0.3096 8.1807 4.0684 3.5480 2.6443 68.5201 0.4686 7.9430 42.8393 3.6367 2.3462 12.6992 0.5025 33.2592 2.3525 138.6609 2.3871 265.9046 1.4967 0.3693 1.1608 0.6837 0.2822 2.9488 2.0122 12.9826 2.4435 59.7440 0.3369 5.4270 0.1240 2.5463 0.8396 6.7875 18.6928 5.1691 18.4665 12.1646 8.8104 23.4944 0.3295 0.8862 1.2578 3.2521 1.9345 13.0641 12.6448 24.8751 19.0801 18.5444 11.2713 1.9785 179.7288 4.5665 4.5657 10.4790 83.2853 38.8203 36.0098 26.7700 7.1393 17.6460 28.3561 21.8137 26.9578 6.5251 2.2984 62.9233 13.2702 0.1113 39.1354 98.9954 52.4496 42.9000 70.1962 44.9988 85.2336
temp: 298.150 k
press: 1.00000 atm
elementType: 8 8 6 6 6 6 6 6 6 6 6 6 6 6 1 1 1 1 1 1 1 1 1 1 1 1 1 1 1 1 1 1 1 1 1 1 1 1
symmnumber: 1
zpe: 888372.9 jmol-1
zpe.correction: 0.338363 hartree
zpe.thermalcorrener: 0.356061 hartree
zpe.thermalcorrenthalpy: 0.357005 hartree
zpe.thermalcorrgfe: 0.290338 hartree
zpe.sumelectzpe: -620.966095 hartree
zpe.sumelectthermal: -620.948397 hartree
zpe.sumelectthermalent: -620.947453 hartree
zpe.sumelectthermalfe: -621.014120 hartree
dipole: -0.9767 0.8491 -1.5495
dipole: 2.0189
quadrupole: -84.8606 -89.2349 -92.7185
quadrupole: 3.7352 -6.1784 3.4984
quadrupole: 4.0774 -0.2969 -3.7805 3.7352 -6.1784 3.4984
hfenergy: -621.3044582 hartree
pointgroup: C01 [X(C12H24O2)]
dipole: -0.3888001 0.3735883 -0.5832293 debye
polarizability: 177.8898065|1.3333188|119.8933152|0.2495046|-3.9093514|117.0451697 unknown
InChI: InChI=1S/C12H24O2/c1-4-7-9-11(6-3)10-14-12(13)8-5-2/h11H,4-10H2,1-3H3
charge 0 multiplicity 1
38 atoms
O  1.284867 -0.002217 -0.257834
O  2.591436 -1.11087 1.321475
C  -1.159727 0.118045 -0.279957
C  -2.449713 -0.531503 0.29478
C  -1.177904 1.674231 -0.271721
C  -3.747157 -0.128188 -0.441059
C  0.056304 -0.450913 0.466333
C  -4.9916 -0.879202 0.086197
C  -1.431034 2.324841 1.10766
C  -6.291743 -0.47463 -0.641434
C  2.506877 -0.416292 0.282469
C  3.661831 0.088438 -0.568733
C  5.043574 -0.319683 -0.020678
C  6.191673 0.183708 -0.91989
H  -1.0650 -0.201738 -1.339499
H  -2.344312 -1.635787 0.243192
H  -2.549257 -0.283857 1.371758
H  -0.208831 2.027809 -0.672141
H  -1.952214 2.022744 -0.982261
H  -3.631926 -0.327943 -1.52719
H  -3.917547 0.962596 -0.340662
H  0.118852 -0.100007 1.512973
H  0.048271 -1.556895 0.477794
H  -4.830594 -1.971539 -0.01979
H  -5.099591 -0.68588 1.173236
H  -0.668614 2.026775 1.850876
H  -1.396508 3.426595 1.026191
H  -2.422516 2.052736 1.513568
H  -6.223052 -0.688457 -1.724804
H  -6.49029 0.607744 -0.526126
H  -7.1659 -1.022301 -0.243993
H  3.577058 1.190168 -0.647806
H  3.519145 -0.293891 -1.598955
H  5.086903 -1.420717 0.072993
H  5.16095 0.076531 1.005214
H  7.174509 -0.113584 -0.511795
H  6.112557 -0.231787 -1.942433
H  6.182424 1.287022 -1.004348
