program: Gaussian 09
title: 000117222
version: EM64L-G09RevD.01
frameworkgroup: C1[X(C13H26N2O4)]
method: RPBEPBE
basis: SDD
operation: Freq
keyword: #p
keyword: freq=noraman
keyword: PBEPBE/SDD
title: #p freq=noraman PBEPBE/SDD
converged: NO YES NO NO
title: Mulliken charges:
elementType: O O O O N N C C C C C C C C C C C C C H H H H H H H H H H H H H H H H H H H H H H H H H H
charge: -0.328301 -0.314384 -0.291128 -0.281689 -0.385242 -0.618855 0.346783 -0.423587 -0.421656 -0.347990 -0.352496 -0.399231 -0.738909 -0.696237 0.299657 0.295215 -0.038667 -0.662098 -0.704956 0.213816 0.192100 0.219816 0.201876 0.247679 0.224441 0.252672 0.228819 0.208611 0.215970 0.217424 0.229538 0.222908 0.208333 0.211547 0.217560 0.242462 0.314781 0.209235 0.247495 0.201948 0.223530 0.233608 0.204568 0.333871 0.339165
chargesum: 0.00000
title: Mulliken charges with hydrogens summed into heavy atoms:
elementType: O O O O N N C C C C C C C C C C C C C
charge: -0.328301 -0.314384 -0.291128 -0.281689 -0.070461 0.054181 0.346783 -0.017671 0.000035 0.124130 0.128994 0.025350 -0.069038 -0.058797 0.299657 0.295215 0.203795 -0.003420 -0.043251
polarizability: 1.83832569e+02 4.38632787e+00 1.75529756e+02 -7.04851150e+00 5.42328666e+00 1.51640690e+02
1716.lowfreq: -12.4603 -9.5838 -0.0009 0.0002 0.0007 3.2795 6.1269 12.3612 24.7836
frequency: 4.0795 11.5125 24.2021 40.0649 46.5989 52.2195 59.7591 61.0640 76.7435 77.9776 114.2223 145.3414 152.6586 169.5424 194.1792 214.9244 215.3092 224.5460 236.2368 250.1146 255.6084 261.6780 294.9834 301.1687 319.8672 340.7930 366.3655 397.2703 446.6243 472.7417 489.4130 504.3823 515.9795 522.3522 532.6233 550.1479 616.8089 681.5724 699.9743 704.6141 732.4847 770.7816 780.1058 833.4661 840.4828 861.6553 876.7635 899.8049 903.5369 919.4920 932.5184 940.2582 949.4448 993.4683 1005.6265 1014.7130 1036.6426 1050.9158 1057.0674 1059.8307 1073.9275 1099.5969 1140.3604 1150.2553 1162.9918 1167.0237 1186.8617 1205.7232 1220.6796 1225.0091 1233.5815 1258.8916 1278.5583 1298.7754 1304.7808 1313.3553 1317.4723 1348.6306 1352.3834 1360.8144 1362.3517 1373.0465 1377.6317 1389.3295 1392.6211 1396.0171 1457.7288 1459.9514 1463.9994 1467.0578 1468.7329 1472.1748 1472.5846 1477.2791 1480.0717 1483.6907 1486.4369 1487.1203 1490.1666 1492.8060 1587.6602 1660.2377 1683.1814 2970.7989 2973.6339 2977.7709 2979.8715 2981.3505 2982.9914 2985.0322 3012.2200 3015.6300 3016.7499 3023.8851 3034.4679 3039.7485 3070.9815 3071.2844 3073.0818 3073.5482 3077.0630 3079.9341 3081.7515 3082.7380 3092.7517 3095.5548 3559.3744 3559.5296 3717.8834
redmass: 7.2767 4.6396 3.4927 3.6783 4.0634 1.9575 3.2802 2.8806 4.1987 2.8998 3.3103 5.7886 4.5325 1.9919 3.0834 1.0373 2.2416 2.0870 1.8105 1.7314 1.6229 1.7806 2.5371 2.5040 1.9648 2.6701 2.8228 2.9942 2.6743 3.0042 1.1791 2.7370 1.0639 3.0984 1.1759 2.9416 4.7230 5.6790 11.1622 11.1845 1.1781 1.9605 1.4895 2.9359 3.0297 1.6249 1.9906 3.2676 2.2345 1.2715 1.8809 1.8416 1.8232 1.7454 3.4239 1.8883 3.4297 2.8669 2.0265 2.2759 1.8389 2.0945 2.1598 2.0836 1.8161 1.7914 2.2797 2.2676 1.3490 3.3201 1.1609 1.2569 1.2794 1.7453 1.2079 1.4920 1.5967 1.2778 1.4642 1.4283 1.5440 1.5766 1.2176 1.2149 1.2202 1.2314 1.0872 1.2081 1.0652 1.0800 1.1339 1.0626 1.0739 1.0451 1.0662 1.0630 1.0659 1.0502 1.1571 1.1806 1.2197 10.1665 7.2384 1.0505 1.0444 1.0370 1.0542 1.0364 1.0426 1.0603 1.0616 1.0587 1.0918 1.0852 1.0990 1.1020 1.1010 1.0987 1.0995 1.0990 1.1039 1.1034 1.0989 1.1055 1.1002 1.1000 1.0445 1.0772 1.1058
irintensity: 0.8978 1.7995 1.7424 2.1528 4.8159 0.3461 3.2900 0.9794 1.1512 1.1225 1.2895 2.3171 3.1800 1.6903 3.4374 0.0387 4.0604 6.4463 4.6648 8.0429 0.6013 7.6213 2.8856 4.9819 2.0946 0.2244 5.3463 3.2251 0.3099 3.1902 298.9838 1.9613 23.1314 0.9729 103.7763 0.4376 2.8183 4.9097 15.9297 29.5311 17.5782 7.6511 11.6390 14.1147 8.4936 10.2378 3.3740 10.0239 12.4863 9.4640 23.1691 13.3194 13.4871 23.2352 110.1112 95.9244 209.8055 36.0960 15.1392 50.7399 5.8774 18.3850 31.8823 45.9210 0.1852 0.6025 8.2072 262.0716 13.0598 6.8023 1.4761 0.3457 70.2039 236.8509 56.9986 34.0074 50.7373 16.2054 3.7101 5.0283 16.0702 51.2770 27.9451 10.6034 17.2164 37.0487 25.2101 163.9589 5.7533 30.9191 67.8116 6.3147 6.0108 14.4357 24.6830 21.4265 47.4014 5.6568 58.7582 50.8325 112.4154 212.6687 377.5771 12.3048 36.6465 22.8191 10.7503 27.7939 28.3748 54.8111 25.7712 23.0423 6.4346 2.0370 12.0065 24.3809 70.9700 10.6107 9.3014 82.9195 8.9239 74.3881 79.7793 25.4534 22.9352 39.2063 58.7031 21.6861 47.3826
temp: 298.150 k
press: 1.00000 atm
elementType: 8 8 8 8 7 7 6 6 6 6 6 6 6 6 6 6 6 6 6 1 1 1 1 1 1 1 1 1 1 1 1 1 1 1 1 1 1 1 1 1 1 1 1 1 1
symmnumber: 1
zpe: 1012737.6 jmol-1
zpe.correction: 0.385731 hartree
zpe.thermalcorrener: 0.409772 hartree
zpe.thermalcorrenthalpy: 0.410716 hartree
zpe.thermalcorrgfe: 0.326769 hartree
zpe.sumelectzpe: -919.872928 hartree
zpe.sumelectthermal: -919.848888 hartree
zpe.sumelectthermalent: -919.847943 hartree
zpe.sumelectthermalfe: -919.931891 hartree
dipole: 0.4255 -0.0939 0.1722
dipole: 0.4686
quadrupole: -104.8442 -106.1556 -125.9680
quadrupole: 0.4059 -14.5607 11.6713
quadrupole: 7.4784 6.1670 -13.6454 0.4059 -14.5607 11.6713
hfenergy: -920.2586595 hartree
pointgroup: C01 [X(C13H26N2O4)]
dipole: 0.1713081 0.0284196 -0.061885 debye
polarizability: 182.785151|-5.3569403|175.7110749|8.0525922|5.7653402|152.5067888 unknown
InChI: InChI=1S/C13H26N2O4/c1-5-7-13(6-2,8-18-11(14)16)9-19-12(17)15-10(3)4/h10,15H,5-9,14H2,1-4H3
charge 0 multiplicity 1
45 atoms
O  0.84638 0.420865 -0.049268
O  -1.946423 -1.694879 -0.245035
O  2.316449 0.096873 -1.870153
O  -2.076482 -3.091839 1.651393
N  3.05402 0.056311 0.362208
N  -2.127848 -3.941916 -0.537946
C  -1.585381 0.737571 -0.210717
C  -1.480396 1.941217 0.781349
C  -2.726007 0.923583 -1.262192
C  -0.274654 0.562576 -1.012401
C  -1.824406 -0.518868 0.656445
C  -1.294621 3.336618 0.141901
C  -4.139985 1.145246 -0.68334
C  -1.158945 4.440889 1.213563
C  2.110288 0.176172 -0.629893
C  -2.052113 -2.937657 0.404903
C  4.472345 -0.244336 0.064713
C  4.698146 -1.764635 -0.114408
C  5.360504 0.349444 1.176042
H  -0.628109 1.752023 1.462903
H  -2.390179 1.962681 1.415868
H  -2.743239 0.02778 -1.911886
H  -2.465556 1.779919 -1.915198
H  -0.317464 -0.342524 -1.64291
H  -0.077108 1.433758 -1.662767
H  -0.979076 -0.687986 1.345714
H  -2.75162 -0.432336 1.250906
H  -2.152869 3.572603 -0.517468
H  -0.391529 3.342519 -0.49903
H  -4.870431 1.267922 -1.50379
H  -4.473578 0.286143 -0.073907
H  -4.193097 2.051954 -0.053754
H  -2.055153 4.4777 1.861613
H  -0.283357 4.254468 1.863354
H  -1.033002 5.437797 0.752894
H  4.69814 0.25445 -0.895922
H  2.737889 0.099479 1.332257
H  5.746906 -1.968995 -0.398382
H  4.041932 -2.156525 -0.910382
H  4.480557 -2.308471 0.823723
H  6.425645 0.168051 0.949763
H  5.205997 1.438821 1.271173
H  5.14298 -0.12326 2.153747
H  -2.084813 -3.725101 -1.530459
H  -2.209137 -4.902506 -0.218227
