program: Gaussian 09
title: 000117216
version: EM64L-G09RevD.01
frameworkgroup: C1[X(C14H28N2O4)]
method: RPBEPBE
basis: SDD
operation: Freq
keyword: #p
keyword: freq=noraman
keyword: PBEPBE/SDD
title: #p freq=noraman PBEPBE/SDD
converged: YES YES NO NO
title: Mulliken charges:
elementType: O O O O N N C C C C C C C C C C C C C C H H H H H H H H H H H H H H H H H H H H H H H H H H H H
charge: -0.329604 -0.314241 -0.288349 -0.281942 -0.372253 -0.618351 0.299061 -0.416538 -0.338859 -0.315576 -0.392422 -0.767481 -0.349726 -0.700478 0.301128 -0.405478 0.294136 -0.334593 -0.350177 -0.684909 0.191508 0.211663 0.223343 0.253883 0.226944 0.248776 0.208917 0.201344 0.216284 0.214528 0.239750 0.195056 0.194545 0.216747 0.210121 0.211014 0.251990 0.208666 0.318726 0.195286 0.223499 0.202802 0.188680 0.213835 0.215764 0.208850 0.334790 0.339343
chargesum: 0.00000
title: Mulliken charges with hydrogens summed into heavy atoms:
elementType: O O O O N N C C C C C C C C C C C C C C
charge: -0.329604 -0.314241 -0.288349 -0.281942 -0.053527 0.055782 0.299061 -0.013368 0.138368 0.160143 0.017838 -0.096919 0.039876 -0.062596 0.301128 0.055178 0.294136 0.084192 0.041304 -0.046460
polarizability: 1.92270652e+02 -7.09727826e+00 1.90456997e+02 6.09754828e+00 -2.69716629e+00 1.59402429e+02
1716.lowfreq: -8.9861 -0.0007 -0.0005 -0.0002 4.3505 8.3806 11.3109 15.5449 24.2486
frequency: 10.5392 15.1993 23.4691 34.6622 37.5130 48.8329 58.5255 65.3652 70.3617 87.7232 100.8172 122.7420 126.8902 147.6127 158.1332 183.6728 201.4872 226.2588 227.8474 232.1027 234.3786 237.7642 249.5522 278.6279 288.1781 307.8396 324.9108 364.9511 413.2366 445.6480 485.6024 488.4158 497.6928 510.0049 531.8800 547.0387 554.8081 618.9304 660.5222 699.8871 704.9952 730.0229 741.1030 778.1881 791.9391 819.6418 844.0377 849.4036 883.4081 892.8272 897.9512 908.2100 914.2745 935.4622 968.1762 971.0161 994.7076 1002.5980 1008.3009 1036.3189 1054.4262 1057.2662 1077.1434 1081.4249 1100.2582 1113.6110 1126.0426 1139.2317 1166.5581 1177.1180 1195.9384 1214.6571 1226.1750 1230.7466 1241.8315 1261.6613 1267.8806 1283.1233 1288.3867 1292.7043 1300.0755 1314.7627 1319.6174 1339.5852 1351.0969 1358.0250 1361.5943 1369.1953 1370.5432 1387.8910 1390.8513 1392.3952 1454.3915 1458.1306 1461.0393 1466.6331 1467.6491 1471.0338 1474.7508 1477.2143 1477.5467 1478.3155 1480.8257 1484.9107 1487.5447 1488.2897 1494.0288 1587.7207 1666.1770 1683.9264 2960.6479 2961.2833 2962.8405 2971.6734 2972.9467 2973.8453 2976.9744 2984.0519 2999.1772 3001.4068 3006.5076 3008.9090 3015.8877 3018.0202 3041.5510 3043.9172 3068.3965 3070.6366 3071.3525 3072.8791 3074.1898 3075.3805 3078.9906 3085.9922 3092.3959 3559.1691 3579.9866 3717.5475
redmass: 4.5411 7.0800 3.9455 4.4600 4.4013 5.0905 2.1755 3.1672 3.0135 1.7204 2.8435 2.8708 3.3005 3.4524 4.8241 2.5432 3.7663 3.7863 2.3941 1.1081 1.3150 1.2608 2.8288 3.0740 2.5780 3.1172 1.9411 2.8250 2.9364 2.4091 2.8401 1.2180 2.4470 1.0465 2.0576 1.6185 3.0048 4.9546 4.8600 9.1542 11.1695 1.0863 1.2068 1.4435 1.9753 2.2360 2.2171 3.2809 2.4851 1.9701 1.8972 1.7257 1.5286 1.9556 1.6173 1.5682 1.5064 4.4778 4.1648 3.4496 2.7281 2.0375 1.8238 2.0502 2.0441 3.2289 2.5549 1.8932 1.7555 1.7931 2.1246 1.2934 2.2003 1.3633 1.2657 1.3794 1.3307 1.4859 1.1039 1.1723 2.4128 1.2447 1.2508 1.4845 1.4586 1.6060 1.4685 1.4590 1.3808 1.2146 1.2146 1.2708 1.1177 1.0763 1.0830 1.0719 1.0930 1.1429 1.0589 1.0481 1.0616 1.0454 1.0662 1.2170 1.0791 1.0934 1.2997 1.2185 9.1329 7.2994 1.0595 1.0596 1.0585 1.0382 1.0574 1.0380 1.0595 1.0363 1.0658 1.0971 1.0580 1.0954 1.0823 1.0765 1.1040 1.1004 1.1008 1.1007 1.0992 1.1013 1.1008 1.1007 1.1045 1.1048 1.0995 1.0445 1.0775 1.1058
irintensity: 0.0128 2.9572 0.1470 2.5511 4.1103 4.8153 0.6311 0.7736 2.5429 0.1320 0.7661 0.3603 2.4361 2.4025 2.5742 2.5507 2.3325 4.1252 4.5575 0.2408 3.3335 2.4273 8.9834 8.4492 5.2786 2.0174 1.3845 10.0472 3.0651 0.1450 19.0389 308.9068 6.3951 3.2818 34.6062 76.1323 8.2769 2.5349 5.9053 18.2208 27.1171 15.7388 11.4735 0.4419 0.8697 13.1696 4.5352 18.7866 17.7999 14.3688 5.0309 7.9217 4.6671 25.4772 15.3335 13.1722 5.3268 200.1920 146.3974 6.4364 30.2664 20.4742 9.5501 0.2463 15.8351 85.0465 54.1692 1.1534 1.6764 4.3138 261.8424 2.3983 9.5615 24.4317 19.0982 13.4733 42.0968 14.0473 0.8942 13.3861 359.6195 28.9902 2.5342 1.6756 4.2617 6.9350 14.3623 60.6585 14.5724 12.1307 8.2855 35.5203 33.7281 3.4457 5.2242 1.0925 29.7129 87.4934 2.0811 11.3421 2.7409 8.4773 12.3649 143.1371 11.2631 14.0417 113.2789 114.2115 189.6209 396.3404 8.6658 26.6134 2.1349 27.0140 84.8579 25.0575 54.5433 26.2592 37.2549 0.5823 26.2604 4.2293 9.4549 18.7419 63.6673 38.8388 100.1840 54.2716 47.0811 13.3634 72.2340 22.4801 44.6936 10.5104 40.0320 57.6483 25.0683 48.2548
temp: 298.150 k
press: 1.00000 atm
elementType: 8 8 8 8 7 7 6 6 6 6 6 6 6 6 6 6 6 6 6 6 1 1 1 1 1 1 1 1 1 1 1 1 1 1 1 1 1 1 1 1 1 1 1 1 1 1 1 1
symmnumber: 1
zpe: 1088306.9 jmol-1
zpe.correction: 0.414514 hartree
zpe.thermalcorrener: 0.439666 hartree
zpe.thermalcorrenthalpy: 0.440610 hartree
zpe.thermalcorrgfe: 0.354726 hartree
zpe.sumelectzpe: -959.093738 hartree
zpe.sumelectthermal: -959.068586 hartree
zpe.sumelectthermalent: -959.067642 hartree
zpe.sumelectthermalfe: -959.153526 hartree
dipole: -0.8573 0.2948 0.1223
dipole: 0.9148
quadrupole: -115.0715 -112.1944 -132.1129
quadrupole: -0.5554 17.8559 -2.3804
quadrupole: 4.7214 7.5985 -12.3200 -0.5554 17.8559 -2.3804
hfenergy: -959.5082518 hartree
pointgroup: C01 [X(C14H28N2O4)]
dipole: 0.343665 0.099944 -0.037803 debye
polarizability: 192.5481344|6.8849851|189.7716957|7.2091704|2.6936775|159.8102473 unknown
InChI: InChI=1S/C14H28N2O4/c1-4-6-8-14(3,10-19-12(15)17)11-20-13(18)16-9-7-5-2/h16H,4-11,15H2,1-3H3
charge 0 multiplicity 1
48 atoms
O  0.259561 -0.260842 -0.101503
O  -3.152282 -0.979926 -0.230283
O  1.242258 -1.587878 -1.792437
O  -4.021355 -1.921702 1.749821
N  1.977917 -1.650169 0.439871
N  -4.305025 -2.93569 -0.350409
C  -1.78979 1.063964 -0.365678
C  -1.190358 2.187857 0.540048
C  -0.688941 0.278672 -1.109164
C  -2.563395 0.117938 0.579766
C  -0.341104 3.262812 -0.175419
C  -2.751692 1.649807 -1.432316
C  0.18956 4.332978 0.8073
C  1.047049 5.412481 0.11277
C  1.181316 -1.21161 -0.592656
C  3.071502 -2.610918 0.215409
C  -3.848684 -1.955559 0.506004
C  4.418535 -1.943684 -0.151933
C  4.993479 -1.040885 0.961951
C  6.339105 -0.394846 0.566987
H  -2.030263 2.690715 1.064531
H  -0.565275 1.712592 1.322067
H  -0.131192 0.931336 -1.804804
H  -1.11974 -0.561364 -1.6799
H  -3.38038 0.655297 1.0965
H  -1.893177 -0.324154 1.337562
H  0.522841 2.788721 -0.682781
H  -0.937485 3.76632 -0.962629
H  -2.211811 2.273866 -2.16659
H  -3.519365 2.283041 -0.949912
H  -3.269803 0.842392 -1.978056
H  0.78784 3.835427 1.597811
H  -0.667586 4.813197 1.322235
H  1.421283 6.160317 0.835883
H  0.461783 5.950648 -0.656786
H  1.923084 4.96002 -0.389447
H  2.75736 -3.282519 -0.602766
H  3.186364 -3.218881 1.133176
H  1.82116 -1.247378 1.363421
H  5.147197 -2.746344 -0.387735
H  4.281413 -1.35667 -1.080936
H  4.260958 -0.243911 1.201487
H  5.126668 -1.639123 1.887528
H  6.224441 0.233274 -0.336278
H  6.735057 0.245076 1.376723
H  7.099392 -1.166824 0.343081
H  -4.096867 -2.892987 -1.344816
H  -4.829651 -3.713783 0.038102
