program: Gaussian 09
title: 000117212
version: EM64L-G09RevD.01
frameworkgroup: C1[X(C12H24N2O4)]
method: RPBEPBE
basis: SDD
operation: Freq
keyword: #p
keyword: freq=noraman
keyword: PBEPBE/SDD
title: #p freq=noraman PBEPBE/SDD
converged: YES YES NO NO
title: Mulliken charges:
elementType: O O O O N N C C C C C C C C C C C C H H H H H H H H H H H H H H H H H H H H H H H H
charge: -0.329241 -0.315021 -0.292349 -0.281704 -0.373794 -0.618676 0.295841 -0.417353 -0.334741 -0.314870 -0.392274 -0.767797 -0.349732 -0.700470 0.309583 0.294365 -0.346335 -0.647308 0.190274 0.212101 0.230265 0.247558 0.225526 0.251195 0.201869 0.209318 0.216663 0.214206 0.239937 0.195240 0.194100 0.216456 0.210013 0.211702 0.316131 0.253410 0.216306 0.333971 0.339452 0.217724 0.205446 0.233014
chargesum: 0.00000
title: Mulliken charges with hydrogens summed into heavy atoms:
elementType: O O O O N N C C C C C C C C C C C C
charge: -0.329241 -0.315021 -0.292349 -0.281704 -0.057664 0.054748 0.295841 -0.014978 0.143082 0.161851 0.018913 -0.096992 0.039608 -0.062299 0.309583 0.294365 0.123381 0.008877
polarizability: 1.70161147e+02 -3.76340536e+00 1.64941797e+02 6.17200257e+00 2.50798508e+00 1.43811567e+02
1716.lowfreq: -12.8920 -11.4427 -5.3111 -0.0008 -0.0005 -0.0004 8.4395 9.3195 19.2456
frequency: -9.6034 8.4819 19.0735 34.2250 40.5603 43.8110 63.1599 68.1862 84.2427 104.6810 125.9471 148.7106 151.9875 184.8577 192.1596 216.6868 224.7405 228.8057 238.0474 250.1115 275.9206 293.5777 319.8985 334.0283 390.5792 416.1966 448.2017 484.4611 487.3006 511.3436 527.5497 549.1695 563.3464 618.0629 663.2973 696.4994 704.7402 727.9200 773.7836 780.8229 808.4629 847.8867 885.5825 891.1250 897.0105 898.6849 910.3785 916.6762 962.4368 995.8319 997.0439 1007.2557 1036.7773 1056.7980 1075.5970 1080.4799 1080.9314 1099.6979 1125.9510 1144.6414 1163.4882 1178.3110 1200.3864 1213.7944 1224.4575 1237.6590 1259.4701 1279.3968 1284.9129 1290.3247 1299.9451 1318.9095 1338.6785 1355.0367 1356.6108 1362.4867 1370.1076 1389.0057 1390.8289 1392.3419 1454.8319 1465.3266 1466.7094 1468.5774 1470.4555 1471.5714 1475.0826 1477.9333 1478.8518 1482.0903 1486.8589 1487.7968 1498.6805 1587.5439 1667.8369 1684.0542 2960.5497 2962.2905 2972.5888 2972.6908 2982.3637 2983.3196 2992.8154 3001.4259 3006.5890 3017.7010 3020.1412 3043.1007 3066.4409 3069.3996 3071.5499 3075.2511 3081.5251 3083.2558 3084.7107 3091.3090 3097.2594 3559.2999 3566.9362 3717.7685
redmass: 4.2241 6.7532 3.3665 3.4674 3.5170 1.8915 4.4186 3.5894 3.7998 2.8781 2.4479 3.5358 6.4782 2.2701 1.8632 1.1914 3.0416 2.4181 1.2063 2.8636 2.7601 2.5378 1.9514 3.5305 2.6772 2.9202 2.4067 2.7701 1.2172 1.0515 3.6864 3.0267 1.1985 5.0670 4.5789 11.7794 11.2824 1.0918 1.5902 1.2856 2.1259 4.6277 2.1172 2.0837 2.2104 3.0328 1.3686 1.8135 1.6130 2.7486 1.8775 5.3526 3.4561 2.0245 1.7130 2.4766 2.1564 2.0420 2.8296 1.9268 1.7615 1.8273 2.2613 1.3042 2.1939 1.2756 1.3389 1.5328 1.1570 1.1561 2.4473 1.2589 1.4752 1.3476 1.6363 1.4087 1.4710 1.2213 1.2224 1.2565 1.0772 1.0773 1.1013 1.0691 1.0679 1.0558 1.0674 1.0650 1.0448 1.0713 1.0823 1.1093 1.5826 1.2177 9.3291 7.3188 1.0605 1.0587 1.0576 1.0379 1.0359 1.0367 1.0665 1.0973 1.0582 1.0737 1.0824 1.1037 1.0978 1.1007 1.0993 1.0991 1.1050 1.1069 1.0975 1.0996 1.1017 1.0445 1.0770 1.1058
irintensity: 2.3670 1.0202 1.6404 1.6760 3.7954 1.7588 0.1984 5.2190 2.2361 1.1429 0.3298 2.3624 3.2287 1.6358 1.2836 0.8188 7.4104 5.9445 1.1525 7.2428 8.7163 3.9338 0.8263 15.7288 1.6632 2.1749 0.3996 23.6812 289.5750 14.3811 1.3775 0.5728 116.7894 2.5585 4.9491 18.9288 29.8610 14.0888 1.4479 5.0347 12.0631 19.9582 1.7471 18.0058 1.3007 17.0204 8.8371 4.8638 13.6374 140.6445 74.7837 175.9567 5.8290 19.0932 8.8938 40.5687 1.9572 16.4671 112.8056 14.8751 2.2269 2.6691 310.5243 3.3985 9.2146 18.9633 10.3151 6.1738 64.8418 7.0135 370.6962 4.9725 4.3846 4.4816 14.5828 8.4764 70.7516 25.7222 17.7789 19.7343 2.9622 10.1103 63.4766 8.8922 16.2718 9.2943 7.1443 8.0309 7.8552 15.1302 23.7651 76.7393 187.6580 114.0205 207.1658 396.6837 10.3876 3.1830 56.9016 54.6708 28.5721 25.6006 51.1222 0.4934 27.9615 11.8766 11.5767 58.8424 9.8752 86.9246 51.5853 25.5338 39.6840 12.2128 35.6840 40.3970 36.6852 57.5103 23.9402 47.9702
temp: 298.150 k
press: 1.00000 atm
elementType: 8 8 8 8 7 7 6 6 6 6 6 6 6 6 6 6 6 6 1 1 1 1 1 1 1 1 1 1 1 1 1 1 1 1 1 1 1 1 1 1 1 1
symmnumber: 1
zpe: 940414.7 jmol-1
zpe.correction: 0.358185 hartree
zpe.thermalcorrener: 0.379922 hartree
zpe.thermalcorrenthalpy: 0.380866 hartree
zpe.thermalcorrgfe: 0.303502 hartree
zpe.sumelectzpe: -880.648239 hartree
zpe.sumelectthermal: -880.626502 hartree
zpe.sumelectthermalent: -880.625558 hartree
zpe.sumelectthermalfe: -880.702922 hartree
dipole: -0.4187 -0.2163 -0.0126
dipole: 0.4714
quadrupole: -101.5887 -99.5203 -117.8987
quadrupole: -1.4301 19.0911 4.8423
quadrupole: 4.7472 6.8156 -11.5628 -1.4301 19.0911 4.8423
hfenergy: -881.006424 hartree
pointgroup: C01 [X(C12H24N2O4)]
dipole: -0.1733847 0.0651852 0.0094476 debye
polarizability: 168.9997078|4.4565956|165.7850146|-6.7403836|2.2267144|144.1297893 unknown
InChI: InChI=1S/C12H24N2O4/c1-4-6-7-12(3,8-17-10(13)15)9-18-11(16)14-5-2/h14H,4-9,13H2,1-3H3
charge 0 multiplicity 1
42 atoms
O  -0.682535 0.626053 -0.041498
O  2.787336 0.367309 -0.276229
O  -1.676208 1.929501 -1.740663
O  3.865855 1.082959 1.695708
N  -2.076765 2.3217 0.547204
N  4.415613 1.947033 -0.418599
C  0.905119 -1.210084 -0.390413
C  0.039594 -2.145664 0.513536
C  0.045712 -0.134809 -1.08897
C  1.934993 -0.533624 0.542774
C  -1.089981 -2.926048 -0.195549
C  1.641374 -2.01451 -1.493946
C  -1.85791 -3.848671 0.780374
C  -3.003772 -4.625208 0.097084
C  -1.50731 1.665971 -0.521363
C  3.713245 1.13766 0.450143
C  -3.024352 3.43295 0.374077
C  -4.462617 3.066703 0.797495
H  0.720347 -2.874547 1.00199
H  -0.410025 -1.53631 1.322242
H  -0.689209 -0.586641 -1.778306
H  0.680755 0.564817 -1.659429
H  2.58288 -1.28598 1.030533
H  1.434969 0.066494 1.322514
H  -0.676515 -3.541779 -1.019036
H  -1.810164 -2.219938 -0.654833
H  0.933609 -2.438816 -2.228099
H  2.205915 -2.852815 -1.044747
H  2.357328 -1.372689 -2.035626
H  -2.266388 -3.237564 1.611094
H  -1.147014 -4.564426 1.241979
H  -3.538292 -5.273843 0.815268
H  -2.618121 -5.268441 -0.716427
H  -3.742573 -3.931578 -0.347107
H  -1.844662 1.987501 1.483319
H  -2.997041 3.703898 -0.694934
H  -2.668579 4.30841 0.951572
H  4.213577 1.936361 -1.415104
H  5.125665 2.565875 -0.038586
H  -5.135142 3.932103 0.652758
H  -4.508857 2.776195 1.863595
H  -4.843551 2.225592 0.192605
