program: Gaussian 09
title: 000117196
version: EM64L-G09RevD.01
frameworkgroup: C1[X(C10H20N2O4)]
method: RPBEPBE
basis: SDD
operation: Freq
keyword: #p
keyword: freq=noraman
keyword: PBEPBE/SDD
title: #p freq=noraman PBEPBE/SDD
converged: YES YES NO NO
title: Mulliken charges:
elementType: O O O O N N C C C C C C C C C C H H H H H H H H H H H H H H H H H H H H
charge: -0.329416 -0.314779 -0.294915 -0.281989 -0.379459 -0.618350 0.297156 -0.387287 -0.337186 -0.310882 -0.767913 -0.400380 -0.694671 0.322640 0.294802 -0.607951 0.188665 0.211123 0.222332 0.255224 0.226554 0.247520 0.216179 0.214724 0.240586 0.216475 0.209813 0.217690 0.210753 0.209418 0.323302 0.334999 0.339344 0.228382 0.270850 0.226647
chargesum: 0.00000
title: Mulliken charges with hydrogens summed into heavy atoms:
elementType: O O O O N N C C C C C C C C C C
charge: -0.329416 -0.314779 -0.294915 -0.281989 -0.056157 0.055994 0.297156 0.012501 0.140369 0.163192 -0.096423 0.025908 -0.056810 0.322640 0.294802 0.117927
polarizability: 1.39760343e+02 6.04814864e+00 1.44462476e+02 6.42813332e+00 -2.06414764e+00 1.26644365e+02
1716.lowfreq: -22.3611 -13.0013 -8.7733 -5.6382 -0.0009 -0.0009 -0.0007 3.8822 11.1942
frequency: -18.9057 -7.5287 10.8019 36.6292 48.0491 69.7427 80.3040 103.4496 112.3685 132.4472 165.3187 177.7210 191.5874 214.1120 219.2968 226.6760 239.3859 266.3425 296.9504 308.5081 320.8146 366.2302 441.2751 473.8770 488.4014 509.3115 525.3897 556.1291 566.0685 619.8774 667.1705 697.9421 704.7393 736.5148 788.1342 843.6691 857.6236 877.2527 884.7381 904.0089 931.7178 944.8311 975.1650 991.0218 1009.5944 1052.5671 1057.3537 1069.3047 1097.6872 1106.0899 1126.4847 1144.5004 1163.7857 1173.2092 1202.0620 1221.6140 1235.4495 1240.7389 1275.8110 1297.1978 1309.5205 1316.1290 1356.5865 1358.6393 1366.6953 1386.4829 1393.7311 1429.9561 1453.9665 1459.5509 1466.0008 1471.6227 1474.8436 1477.2295 1479.2241 1484.6574 1485.0403 1489.0581 1518.1601 1587.7893 1673.9855 1684.0856 2958.5636 2971.8809 2977.4367 2983.5534 2985.9186 3005.0474 3012.7040 3015.5864 3039.6439 3053.8852 3071.0743 3073.0075 3076.1755 3079.5759 3083.5093 3092.7439 3110.9442 3559.1020 3578.8722 3717.6000
redmass: 2.1698 6.0288 5.4376 2.9815 3.7030 3.6481 3.9102 1.1497 3.3387 4.0947 2.8314 3.9613 3.1195 1.4952 1.7787 1.2869 3.6220 3.7192 3.2653 3.1332 1.9705 3.2510 2.4079 3.0104 1.1930 1.0485 4.5177 3.1081 1.1125 4.7927 5.3873 11.8942 11.3222 1.1320 3.0717 4.2217 1.3507 2.7562 2.6497 2.0563 2.0025 2.0763 2.4890 1.4802 8.2422 2.5735 2.0323 1.5839 2.1513 4.9950 1.2795 1.7114 1.7010 1.7191 2.1640 1.6361 1.8148 1.2955 1.3425 2.2588 1.5587 1.2205 1.5827 1.4850 1.5739 1.2130 1.2408 1.1642 1.0826 1.2836 1.0850 1.0658 1.0599 1.0548 1.0561 1.0764 1.0455 1.0609 1.4369 1.2184 8.8044 7.3388 1.0612 1.0356 1.0355 1.0535 1.0422 1.0581 1.0758 1.0796 1.1018 1.1026 1.1016 1.0994 1.1022 1.1022 1.1048 1.0995 1.0979 1.0445 1.0772 1.1058
irintensity: 0.3300 4.3768 1.4771 3.9375 3.3624 5.1962 0.5080 0.3252 1.8909 3.5502 5.5448 3.2860 1.5706 0.8359 3.3608 1.9452 10.8670 7.2594 6.8147 7.7977 1.3137 12.2906 0.1402 3.7609 314.4173 7.2927 0.7891 0.6877 127.0860 2.2348 5.8714 21.8468 28.1988 14.6796 2.9282 20.2208 1.0763 12.2863 7.9832 5.9879 37.4950 26.0084 70.4145 9.3438 178.7661 8.7362 11.6162 6.1711 17.9560 271.5949 0.0372 13.3576 2.3773 3.9183 256.8159 16.2542 1.1734 24.5563 3.2048 361.3580 9.5609 4.8297 15.5891 24.2327 66.0461 6.5105 34.4485 28.8580 7.0495 149.7350 8.8692 2.1111 11.3091 5.8973 9.1424 4.7678 12.9492 34.5090 155.0249 112.4555 154.8290 446.6678 20.5570 45.7144 84.3689 16.5119 30.7347 28.4348 8.4959 23.8959 16.0818 38.2870 71.0269 40.2800 31.3688 50.0763 12.0219 39.5285 3.7936 57.0239 28.1808 48.2595
temp: 298.150 k
press: 1.00000 atm
elementType: 8 8 8 8 7 7 6 6 6 6 6 6 6 6 6 6 1 1 1 1 1 1 1 1 1 1 1 1 1 1 1 1 1 1 1 1
symmnumber: 1
zpe: 793212.8 jmol-1
zpe.correction: 0.302119 hartree
zpe.thermalcorrener: 0.320334 hartree
zpe.thermalcorrenthalpy: 0.321278 hartree
zpe.thermalcorrgfe: 0.253907 hartree
zpe.sumelectzpe: -802.199229 hartree
zpe.sumelectthermal: -802.181014 hartree
zpe.sumelectthermalent: -802.180069 hartree
zpe.sumelectthermalfe: -802.247441 hartree
dipole: -0.6513 0.1954 0.0365
dipole: 0.6810
quadrupole: -89.3796 -88.6071 -102.4887
quadrupole: 3.2836 16.8593 -8.9529
quadrupole: 4.1122 4.8847 -8.9969 3.2836 16.8593 -8.9529
hfenergy: -802.5013478 hartree
pointgroup: C01 [X(C10H20N2O4)]
dipole: -0.2678357 0.0048194 -0.0042032 debye
polarizability: 136.1585003|-3.6046464|147.536802|-7.0908195|-0.0035393|127.1718821 unknown
InChI: InChI=1S/C10H20N2O4/c1-4-5-10(2,6-15-8(11)13)7-16-9(14)12-3/h12H,4-7,11H2,1-3H3
charge 0 multiplicity 1
36 atoms
O  -1.266642 -0.41694 0.107873
O  2.179792 -0.382789 -0.350409
O  -2.023237 -2.026552 -1.447867
O  3.41887 -1.064599 1.537054
N  -2.551073 -2.139432 0.843961
N  3.710563 -2.047587 -0.577088
C  0.404713 1.31582 -0.369389
C  -0.341189 2.312918 0.575508
C  -0.561324 0.286486 -0.994132
C  1.449139 0.587126 0.505656
C  1.115561 2.059496 -1.530589
C  -1.448711 3.17403 -0.074699
C  -2.109016 4.121203 0.951517
C  -1.962534 -1.584918 -0.271078
C  3.138323 -1.166781 0.31686
C  -3.345781 -3.367235 0.772545
H  0.413658 2.992051 1.025877
H  -0.790807 1.738443 1.409427
H  -1.314403 0.777066 -1.636952
H  -0.01321 -0.455979 -1.598551
H  2.176995 1.301328 0.933597
H  0.964425 0.034644 1.329313
H  0.389131 2.518636 -2.224394
H  1.759718 2.865731 -1.133123
H  1.752524 1.366445 -2.106833
H  -2.226291 2.518707 -0.513084
H  -1.029123 3.77278 -0.906172
H  -2.907451 4.727398 0.485868
H  -2.559892 3.548556 1.783861
H  -1.366321 4.816247 1.387173
H  -2.400585 -1.669924 1.736757
H  3.402322 -2.075999 -1.545731
H  4.426422 -2.684501 -0.240294
H  -2.892316 -4.17825 1.372558
H  -3.378522 -3.685873 -0.281475
H  -4.380628 -3.19785 1.123857
