program: Gaussian 09
title: 000117182
version: EM64L-G09RevD.01
frameworkgroup: C1[X(C12H23NO3)]
method: RPBEPBE
basis: SDD
operation: Freq
keyword: #p
keyword: freq=noraman
keyword: PBEPBE/SDD
title: #p freq=noraman PBEPBE/SDD
converged: YES YES NO NO
title: Mulliken charges:
elementType: O O O N C C C C C C C C C C C C H H H H H H H H H H H H H H H H H H H H H H H
charge: -0.331759 -0.469794 -0.284509 -0.374586 0.315011 -0.392306 -0.330947 -0.384776 -0.760441 -0.395911 -0.695834 0.311121 -0.543511 0.562698 -0.812061 -0.706095 0.183139 0.201749 0.264848 0.228470 0.190385 0.211471 0.211460 0.207018 0.256725 0.219939 0.209437 0.217760 0.208403 0.207759 0.347713 0.315136 0.221454 0.261005 0.226195 0.217093 0.236334 0.231468 0.218739
chargesum: 0.00000
title: Mulliken charges with hydrogens summed into heavy atoms:
elementType: O O O N C C C C C C C C C C C C
charge: -0.331759 -0.122080 -0.284509 -0.059450 0.315011 -0.007418 0.162371 0.017080 -0.085238 0.033465 -0.061913 0.311121 -0.061052 0.562698 -0.132437 -0.255888
polarizability: 1.70610810e+02 -5.63915558e+00 1.35913252e+02 3.15838040e+00 -5.14260757e+00 1.37857868e+02
1716.lowfreq: -13.2394 -9.0925 -0.0001 0.0003 0.0004 4.8842 10.2354 17.0126 32.9125
frequency: -2.7470 16.6706 32.8025 37.3339 51.7471 55.0963 85.2035 100.3134 112.9313 135.6453 162.4503 177.5285 185.0905 206.3500 213.0976 229.7306 247.3443 259.7998 278.0062 303.7925 320.5464 336.5569 377.7423 384.8627 408.3245 444.5850 495.1583 526.5594 569.5349 582.9153 656.7424 697.9882 707.6694 734.2730 780.4666 816.8452 854.6995 864.1924 871.4929 913.0367 926.1228 938.9801 954.1098 964.5313 969.0319 977.8508 982.6901 992.2693 1038.0860 1050.9994 1061.8959 1068.6844 1099.3789 1103.1554 1141.8248 1170.9324 1185.7696 1187.5808 1228.9208 1240.6368 1243.6447 1260.1596 1278.7436 1298.6183 1308.8824 1316.0802 1347.4737 1356.2412 1364.6175 1380.5145 1387.8118 1390.1848 1403.9578 1432.9301 1445.7313 1453.1757 1464.1967 1465.8896 1468.3213 1473.0387 1476.0209 1476.9273 1478.7340 1484.6869 1485.7754 1493.1215 1664.9728 1677.6843 2938.3372 2956.7201 2961.5480 2970.6014 2976.0382 2980.8117 2983.6012 3002.6494 3011.2766 3021.0135 3033.8718 3037.8962 3069.8366 3071.2163 3072.5066 3082.4360 3087.9134 3087.9566 3090.9936 3095.6202 3194.9208 3577.1865 3592.2873
redmass: 3.6648 3.5340 2.8336 2.8066 6.5689 2.1301 4.3546 3.3353 3.5785 3.4770 1.7292 1.0967 1.2194 1.3107 2.3419 1.2955 3.3393 4.5221 3.0460 3.0778 2.0294 4.0076 3.3168 1.9294 2.3539 2.3300 2.5110 1.3380 2.6980 2.5024 5.4106 4.0961 1.4873 1.1422 2.9404 3.3132 1.4347 2.0358 3.0424 2.0185 2.0964 1.9008 1.3413 1.8076 1.4239 3.6164 2.8853 1.4995 1.5995 2.5559 1.8283 1.5534 2.1611 6.4540 1.5109 1.6350 1.4514 2.0794 1.2835 1.4126 1.3650 1.5594 1.3354 2.4789 1.5393 1.2933 1.2517 1.5568 1.4575 1.2345 1.2206 1.2366 1.3220 1.1603 1.1295 1.0785 1.0872 1.0615 1.0821 1.0977 1.0846 1.0547 1.0628 1.0869 1.1847 1.2970 9.2971 5.1588 1.0571 1.0604 1.0381 1.0356 1.0665 1.0427 1.0534 1.1039 1.0965 1.0594 1.0965 1.1019 1.1015 1.0993 1.0986 1.0952 1.0997 1.1044 1.0633 1.0997 1.1143 1.0772 1.0668
irintensity: 0.2477 0.9664 0.0450 0.3518 5.8268 0.2812 0.5536 0.8323 3.6644 1.7999 89.1738 8.2669 33.5753 35.3465 2.4083 0.2579 1.4186 12.2524 9.1470 3.2229 1.7774 4.3472 6.3447 4.6530 4.8463 1.2912 13.8994 115.7263 2.4521 23.4014 4.3293 15.4171 3.2429 12.8129 8.4789 12.0842 2.4356 2.4531 26.4716 11.1960 31.2798 46.7225 60.2823 11.5663 17.2222 64.7162 95.5536 10.4342 1.5695 2.2757 26.3281 6.7247 9.4080 130.8645 26.1139 1.9577 17.1190 319.9110 0.5663 4.0787 106.2261 2.3387 0.3230 13.6217 5.5569 0.0990 2.6948 2.9529 0.8780 17.6321 10.9075 29.0349 14.8075 7.1692 39.9395 5.1340 14.0457 9.4269 27.1839 36.1400 84.5787 3.4955 10.1000 18.3874 113.8914 104.3901 235.2358 9.6693 41.7968 44.6189 29.0626 47.3549 48.4612 23.7453 34.0028 28.4322 20.2453 29.5767 30.3289 25.5711 105.2076 15.5625 61.8573 4.4352 29.9779 4.9625 6.8619 28.0035 20.3264 21.2988 3.0273
temp: 298.150 k
press: 1.00000 atm
elementType: 8 8 8 7 6 6 6 6 6 6 6 6 6 6 6 6 1 1 1 1 1 1 1 1 1 1 1 1 1 1 1 1 1 1 1 1 1 1 1
symmnumber: 1
zpe: 880415.3 jmol-1
zpe.correction: 0.335332 hartree
zpe.thermalcorrener: 0.355021 hartree
zpe.thermalcorrenthalpy: 0.355965 hartree
zpe.thermalcorrgfe: 0.285241 hartree
zpe.sumelectzpe: -750.178640 hartree
zpe.sumelectthermal: -750.158951 hartree
zpe.sumelectthermalent: -750.158007 hartree
zpe.sumelectthermalfe: -750.228731 hartree
dipole: 0.0472 0.5917 -4.3895
dipole: 4.4295
quadrupole: -92.3897 -96.4423 -99.4863
quadrupole: 0.4885 -4.8864 4.8250
quadrupole: 3.7164 -0.3362 -3.3802 0.4885 -4.8864 4.8250
hfenergy: -750.5139721 hartree
pointgroup: C01 [X(C12H23N1O3)]
dipole: 0.0070006 -0.1018275 -1.7396954 debye
polarizability: 170.7600939|-5.2801623|135.0979239|-3.1359249|4.844316|138.523912 unknown
InChI: InChI=1S/C12H23NO3/c1-5-6-12(4,8-14)9-16-11(15)13-7-10(2)3/h13-14H,2,5-9H2,1,3-4H3
charge 0 multiplicity 1
39 atoms
O  0.196284 -0.018725 0.00359
O  1.880205 3.103132 -0.175721
O  -1.24895 -0.252298 1.856403
N  -1.907208 -0.813108 -0.331846
C  2.526403 0.753537 0.091333
C  2.963976 -0.502219 -0.724639
C  1.253466 0.490065 0.921612
C  2.248886 1.888977 -0.924477
C  3.637758 1.204867 1.075846
C  3.235141 -1.787593 0.09072
C  3.674811 -2.957994 -0.816581
C  -1.024403 -0.35057 0.623142
C  -3.291205 -1.185626 0.012206
C  -4.320427 -0.09639 -0.296143
C  -4.436072 0.32954 -1.748051
C  -5.087757 0.432585 0.691158
H  3.884083 -0.240887 -1.289665
H  2.180592 -0.727326 -1.476194
H  0.895785 1.424118 1.387202
H  1.426158 -0.261391 1.712268
H  3.166403 2.069529 -1.525728
H  1.424986 1.578285 -1.599719
H  3.80309 0.457604 1.872745
H  4.59344 1.342362 0.535964
H  3.370835 2.166629 1.545556
H  2.320799 -2.081577 0.641632
H  4.019182 -1.601077 0.850073
H  3.859791 -3.876593 -0.230019
H  2.896577 -3.187831 -1.568837
H  4.6055 -2.711167 -1.362088
H  1.53928 3.787629 -0.801772
H  -1.584618 -0.846293 -1.298684
H  -3.546979 -2.108711 -0.547063
H  -3.303209 -1.422684 1.088855
H  -3.487252 0.774647 -2.107502
H  -4.657877 -0.536653 -2.403577
H  -5.232516 1.079326 -1.889612
H  -4.970368 0.123861 1.736248
H  -5.845186 1.198023 0.483862
