program: Gaussian 09
title: 000117137
version: EM64L-G09RevD.01
frameworkgroup: C1[X(C12H16O3S)]
method: RPBEPBE
basis: SDD
operation: Freq
keyword: #p
keyword: freq=noraman
keyword: PBEPBE/SDD
title: #p freq=noraman PBEPBE/SDD
converged: NO YES NO NO
title: Mulliken charges:
elementType: S O O O C C C C C C C C C C C C H H H H H H H H H H H H H H H H
charge: 0.971466 -0.398057 -0.517580 -0.503397 -0.161212 -0.286665 -0.040454 -0.702593 0.001247 -0.260869 -0.193721 0.453152 -0.367597 -0.366798 -0.798225 -0.627880 0.226983 0.225952 0.230469 0.217147 0.213761 0.236189 0.237347 0.291416 0.284669 0.246231 0.245237 0.231005 0.244592 0.231249 0.214939 0.221995
chargesum: 0.00000
title: Mulliken charges with hydrogens summed into heavy atoms:
elementType: S O O O C C C C C C C C C C C C
charge: 0.971466 -0.398057 -0.517580 -0.503397 0.065770 0.169756 -0.040454 -0.035495 0.238594 0.030547 0.090948 0.453152 -0.121365 -0.121561 -0.091378 -0.190947
polarizability: 2.19456876e+02 -1.57548399e+01 1.70618504e+02 7.06029383e+00 1.02626333e+01 1.12900007e+02
1716.lowfreq: -15.4092 -6.3751 -0.0019 -0.0018 -0.0016 4.6714 9.9647 24.8834 32.2090
frequency: -14.7411 23.3240 32.1568 35.4920 48.9040 74.2906 85.9831 129.6359 147.3310 168.9448 208.7462 212.6540 228.1905 247.4829 285.4723 290.3448 306.6572 326.3642 359.1729 388.1460 406.0687 416.0844 458.7938 491.4423 502.6595 536.9064 595.5438 621.5614 685.2272 703.7315 778.5819 798.2871 821.8196 829.8831 847.4684 887.0930 927.3371 938.3731 949.4451 952.7287 960.5747 983.3614 985.6910 989.6901 993.4022 1004.1866 1049.0737 1054.4877 1060.2048 1122.6515 1132.3346 1173.1359 1188.9969 1219.2491 1239.2717 1273.9957 1293.3470 1301.3221 1319.5787 1346.1881 1382.3571 1383.7894 1393.4024 1397.2939 1428.1179 1447.7541 1470.1804 1473.3948 1473.4048 1474.6909 1477.9066 1594.3996 1595.0718 1655.6724 2967.7349 2976.7860 2980.9209 3009.1302 3046.4857 3063.7720 3069.6103 3075.9599 3089.2274 3091.0404 3092.9172 3138.1739 3140.1471 3165.0981 3167.7960 3188.4841
redmass: 1.0219 3.6963 4.0124 4.5523 4.3857 2.8024 4.1495 6.2597 4.9434 3.7792 1.9359 1.7530 6.1922 4.6783 4.0723 2.4315 3.3032 2.1681 4.5726 5.0378 2.9287 3.9326 5.0402 3.0923 3.2807 6.4011 6.3741 6.9590 1.7218 3.3198 4.9528 2.0372 1.5108 6.4148 1.2557 2.2959 1.6494 1.6305 1.9601 10.2281 1.3187 1.3782 1.2622 1.5245 4.3915 1.1500 1.5977 2.4884 3.3025 1.2973 2.1721 1.7548 1.1300 3.0947 1.2954 1.2675 1.2233 1.2576 1.3315 1.2188 5.0489 1.2521 2.8903 1.2261 1.1939 1.0810 1.1065 1.0939 1.0855 2.0051 1.0585 6.4403 6.4057 4.7225 1.0582 1.0359 1.0389 1.0843 1.1045 1.0948 1.0973 1.0693 1.0921 1.0927 1.1001 1.0895 1.0896 1.0955 1.0970 1.1144
irintensity: 0.6736 0.6555 0.5908 1.1791 0.3150 0.1727 0.5053 2.2708 1.5641 0.6744 1.0492 4.5535 10.2660 2.4285 4.9570 0.8784 5.1441 0.6344 7.0109 9.8265 0.7646 31.0545 28.7281 7.8655 18.6601 124.4981 52.5951 1.5852 33.6395 1.4318 3.9477 0.1440 81.7284 45.0127 3.7358 48.2755 3.8315 12.1021 198.7773 64.1589 0.6456 2.2356 11.3992 6.2989 1.5541 19.4612 21.9100 20.2439 1.4693 5.4406 5.7744 1.1882 9.2135 5.0689 2.1443 0.1376 1.6606 1.7996 2.5747 6.6184 1.5779 13.4178 10.9830 16.3093 9.1707 7.1780 17.6507 2.4771 26.4614 19.5889 8.9540 9.7344 7.0865 14.5436 23.2791 45.6638 21.3616 10.3777 14.3248 17.8641 30.1216 20.7021 22.1202 11.4773 14.6670 13.7210 5.6913 0.4990 14.4659 22.2303
temp: 298.150 k
press: 1.00000 atm
elementType: 16 8 8 8 6 6 6 6 6 6 6 6 6 6 6 6 1 1 1 1 1 1 1 1 1 1 1 1 1 1 1 1
symmnumber: 1
zpe: 660038.3 jmol-1
zpe.correction: 0.251395 hartree
zpe.thermalcorrener: 0.268848 hartree
zpe.thermalcorrenthalpy: 0.269792 hartree
zpe.thermalcorrgfe: 0.204063 hartree
zpe.sumelectzpe: -1089.194800 hartree
zpe.sumelectthermal: -1089.177348 hartree
zpe.sumelectthermalent: -1089.176403 hartree
zpe.sumelectthermalfe: -1089.242133 hartree
dipole: -2.5209 4.2087 -1.4271
dipole: 5.1093
quadrupole: -77.7533 -109.4952 -108.5547
quadrupole: -2.8866 -0.8608 4.1117
quadrupole: 20.8478 -10.8942 -9.9536 -2.8866 -0.8608 4.1117
hfenergy: -1089.4461954 hartree
pointgroup: C01[X(C12H16O3S1)]
dipole: 0.8641461 1.7736687 0.3848301 debye
polarizability: 216.5148876|20.347482|169.6577944|9.6535128|-15.8968296|116.8027047 unknown
InChI: InChI=1S/C12H16O3S/c1-4-10(2)9-15-16(13,14)12-7-5-11(3)6-8-12/h4-8,10H,1,9H2,2-3H3
charge 0 multiplicity 1
32 atoms
S  -0.308858 -1.759551 -0.162737
O  -1.430474 -0.834131 1.026271
O  -0.982314 -1.625108 -1.635911
O  0.039291 -3.227641 0.423532
C  -3.426287 0.528151 0.478594
C  -2.866088 -0.900625 0.672677
C  1.193889 -0.659276 0.017707
C  -4.978317 0.445699 0.417704
C  -2.880842 1.178944 -0.779171
C  2.28487 -1.167135 0.739413
C  1.175471 0.610428 -0.581364
C  3.470658 0.944263 0.265735
C  3.428067 -0.346465 0.856013
C  2.332187 1.407904 -0.447796
C  4.717102 1.802835 0.371018
C  -2.266452 2.38705 -0.83274
H  -3.134298 1.133577 1.358228
H  -3.373572 -1.418572 1.50796
H  -3.005689 -1.487996 -0.258698
H  -5.388766 -0.022473 1.331983
H  -5.311698 -0.151668 -0.452134
H  -5.412703 1.455384 0.319715
H  -3.030792 0.606448 -1.708555
H  2.238903 -2.165672 1.185317
H  0.292645 0.966724 -1.120817
H  4.295944 -0.714676 1.414562
H  2.347874 2.405623 -0.900883
H  5.303882 1.559614 1.273388
H  5.376833 1.643511 -0.503803
H  4.468445 2.877865 0.401498
H  -1.93194 2.819474 -1.783291
H  -2.091567 2.983194 0.071983
