program: Gaussian 09
title: 000116785
version: EM64L-G09RevD.01
frameworkgroup: C1[X(C22H22Cl2N5O2)]
method: RPBEPBE
basis: SDD
operation: Freq
keyword: #p
keyword: freq=noraman
keyword: PBEPBE/SDD
title: #p freq=noraman PBEPBE/SDD
converged: YES YES NO NO
title: Mulliken charges:
elementType: Cl Cl O O N N N N N C C C C C C C C C C C C C C C C C C C C C C H H H H H H H H H H H H H H H H H H H H H H
charge: 0.020534 0.008152 -0.185589 -0.188039 -0.132924 -0.050997 -0.026146 -0.095954 0.022875 -0.477784 -0.430218 0.498832 -0.384039 -0.559720 -0.357755 0.404110 -0.643824 -0.048446 -0.291968 -0.115106 -0.114338 -0.790730 -0.181958 -0.182894 -0.151304 0.464829 -0.264686 -0.184530 0.442781 -0.392256 -0.386044 0.263012 0.266013 0.256807 0.298492 0.243554 0.214278 0.208759 0.248550 0.240854 0.220120 0.249765 0.289198 0.284472 0.283530 0.266085 0.261223 0.194061 0.278084 0.278010 0.289257 0.321528 0.319482
chargesum: 1.00000
title: Mulliken charges with hydrogens summed into heavy atoms:
elementType: Cl Cl O O N N N N N C C C C C C C C C C C C C C C C C C C C C C
charge: 0.020534 0.008152 -0.185589 -0.188039 -0.132924 -0.050997 -0.026146 -0.095954 0.022875 0.051242 0.125081 0.498832 0.073793 -0.350961 -0.109205 0.404110 0.066914 -0.048446 -0.002769 0.169366 0.169192 -0.069361 0.096126 0.095116 0.137953 0.464829 -0.264686 -0.184530 0.442781 -0.070728 -0.066562
polarizability: 1.45178834e+03 -1.13807302e+02 3.61607974e+02 7.76516758e+00 -1.36048084e+01 1.68216436e+02
1716.lowfreq: -4.6199 -2.0741 -0.0013 0.0009 0.0019 3.7018 11.5563 12.5170 17.1819
frequency: 11.4818 12.3537 17.1618 25.3481 31.6092 39.5078 53.4993 55.2046 67.2148 72.5941 83.3158 101.8257 106.2610 114.5538 124.9176 135.9425 159.2740 181.9808 200.4369 202.7998 209.5712 214.6901 218.9320 238.3721 252.4029 270.1306 310.8785 332.3403 338.7649 352.7362 371.9588 384.4785 389.5088 395.3259 400.3264 437.1377 462.4094 466.9857 491.5054 501.1764 513.0358 521.7259 532.3959 542.2200 561.0618 585.0240 606.2607 612.6812 641.6391 673.0661 681.2421 693.8235 700.1307 733.0764 747.3577 753.4105 762.7708 770.1228 789.8783 800.5613 813.1512 817.0359 823.7881 836.8506 844.3927 859.2594 872.9961 914.5024 921.9568 923.2250 936.0209 968.1539 978.3318 985.6006 994.8926 1007.2813 1008.4725 1020.8797 1041.3661 1042.3106 1043.3247 1053.9460 1078.2988 1091.1552 1100.7105 1116.8921 1145.9545 1152.5726 1169.9205 1175.5581 1182.4770 1183.6065 1197.7332 1204.4279 1213.4253 1225.8830 1249.2896 1262.4585 1289.7187 1296.6701 1322.0186 1340.5936 1347.8994 1351.4008 1352.3059 1362.5371 1374.7165 1377.2656 1377.6984 1395.5164 1397.1154 1400.2747 1405.7302 1406.7474 1440.5212 1450.8986 1457.6601 1468.1417 1474.2008 1477.9442 1482.0088 1489.4655 1493.8885 1498.2847 1512.1064 1536.1836 1551.8431 1556.1262 1578.8534 1604.7006 1617.7977 2993.0206 2995.0118 3001.6441 3006.6697 3043.0009 3055.2453 3064.7416 3079.6001 3092.8070 3095.4687 3104.2477 3113.9227 3132.8541 3157.2218 3177.5225 3181.0640 3181.7715 3188.1663 3190.0290 3191.9884 3198.9868 3207.0765
redmass: 9.5442 6.8228 6.4251 7.1586 4.1717 4.3485 4.0387 16.2961 4.8822 4.6209 3.5784 1.2318 3.1644 5.0120 7.8799 7.8425 15.9669 3.8370 2.6686 5.0843 7.3388 3.4213 1.7335 5.0014 2.7048 3.3315 7.9677 4.2693 22.5523 8.0916 5.0895 3.1070 3.9615 4.9123 2.7533 3.9921 3.4603 3.5357 3.8318 5.6687 5.3646 5.6658 4.2975 4.6505 4.0945 4.1536 4.8586 3.7332 6.3436 3.7119 3.2798 4.3454 6.8316 4.5049 4.9608 6.8248 1.6426 6.8059 1.3899 1.5202 2.7939 2.1570 1.7535 1.6914 1.3096 3.1633 8.5142 1.3487 1.3874 1.4774 2.4401 4.9961 1.3763 1.3597 2.0208 2.7968 1.7908 1.8939 2.2943 2.5601 1.6368 1.8528 1.9736 1.7452 2.2861 4.4547 1.6245 4.2163 1.5076 1.5662 1.6095 1.8697 6.3160 2.2838 1.2171 1.6889 2.9415 1.6585 1.2389 1.3630 1.2248 1.3462 4.9315 1.4778 1.7848 2.9211 2.6592 5.9979 2.5819 2.9477 1.2119 3.5632 1.6230 3.1029 2.0188 1.0556 1.5331 1.0466 2.4494 1.2411 1.2477 1.2711 1.7616 1.3428 1.1294 4.7418 7.1273 9.4903 7.9662 5.4848 5.3215 1.0371 1.0363 1.0605 1.0620 1.0593 1.1019 1.1029 1.0975 1.1003 1.0993 1.1009 1.1086 1.0889 1.0887 1.0894 1.0949 1.0894 1.0930 1.0952 1.0936 1.0987 1.1036
irintensity: 0.2293 1.0407 0.0998 0.4539 0.1749 0.0830 0.3370 0.0123 0.5732 0.6422 1.6343 3.1525 0.4247 8.3673 2.2280 10.3359 2.5058 5.3750 8.1141 5.2303 48.7258 3.6693 1.5274 4.3394 1.0274 3.7384 40.7768 2.7663 1.7421 14.1944 0.6146 6.5890 7.2428 17.4907 0.7436 14.8121 33.9267 22.2592 6.2736 4.8743 7.8606 5.7012 5.5047 32.2137 1.1297 0.5984 6.1278 9.7709 0.1972 11.7312 45.4089 13.3925 10.3718 18.3375 22.3752 37.7268 61.5613 47.8810 2.8795 5.4758 133.6760 228.1143 41.9487 50.1772 3.4408 26.6874 38.2568 0.0930 9.5839 50.8342 0.1670 8.0098 0.1409 1.3387 22.9808 140.5330 66.0000 20.5903 3.7118 46.3243 11.2794 6.7361 14.0492 14.8220 23.1951 27.6367 8.6585 301.2009 38.9275 3.6262 2.6943 4.0351 1118.2696 238.2829 71.1023 3.7723 15.6887 24.6485 1.2139 9.7585 7.9389 81.0477 53.4482 48.1438 267.0264 137.3342 20.9850 19.4852 1.4928 135.1517 29.9472 75.6856 41.3490 39.6352 18.6008 10.0892 114.7296 14.7725 34.8542 0.8866 2.9086 32.0628 44.8075 22.8466 10.1297 1.7743 52.6314 35.2111 48.5350 194.3744 697.7734 12.1196 16.0297 25.6237 20.8266 17.0371 2.6263 5.5984 3.7380 24.8601 3.1519 19.1454 3.4551 6.0874 0.8304 33.5563 10.2812 0.4260 13.0804 1.5353 22.0387 0.6103 19.5253
temp: 298.150 k
press: 1.00000 atm
elementType: 17 17 8 8 7 7 7 7 7 6 6 6 6 6 6 6 6 6 6 6 6 6 6 6 6 6 6 6 6 6 6 1 1 1 1 1 1 1 1 1 1 1 1 1 1 1 1 1 1 1 1 1 1
symmnumber: 1
zpe: 1061430.9 jmol-1
zpe.correction: 0.404278 hartree
zpe.thermalcorrener: 0.434050 hartree
zpe.thermalcorrenthalpy: 0.434994 hartree
zpe.thermalcorrgfe: 0.337868 hartree
zpe.sumelectzpe: -2193.264386 hartree
zpe.sumelectthermal: -2193.234614 hartree
zpe.sumelectthermalent: -2193.233670 hartree
zpe.sumelectthermalfe: -2193.330795 hartree
dipole: 34.2927 -1.3110 -0.5209
dipole: 34.3217
quadrupole: -8.2260 -162.3173 -187.1383
quadrupole: -34.2134 -4.2992 -13.9769
quadrupole: 111.0012 -43.0901 -67.9111 -34.2134 -4.2992 -13.9769
hfenergy: -2193.6686635 hartree
pointgroup: C01 [X(C22H22Cl2N5O2)]
dipole: 13.4742025 -0.8813953 -0.0722448 debye
polarizability: 1444.9878081|-140.4109378|363.6772053|25.6665999|-33.4039645|172.9477349 unknown
InChI: InChI=1S/C22H22Cl2N5O2/c1-3-28(12-11-27-9-5-4-6-10-27)17-7-8-21(16(2)13-17)25-26-22-19(23)14-18(29(30)31)15-20(22)24/h4-10,13-15H,3,11-12H2,1-2H3
charge 1 multiplicity 1
53 atoms
Cl -4.648269 3.010091 0.796814
Cl -3.260435 -2.267766 -0.583584
O  -9.101173 0.179222 0.186823
O  -8.506255 -1.966291 -0.330247
N  3.579102 1.786349 -0.352954
N  6.079186 -1.074826 -0.154183
N  -1.775853 0.104749 0.511417
N  -2.738306 0.873845 0.075654
N  -8.227153 -0.739362 -0.046881
C  4.687336 1.017028 0.191036
C  5.010583 -0.216424 -0.733419
C  2.245129 1.397234 -0.13388
C  3.919912 2.997321 -1.149357
C  1.924302 0.236083 0.640849
C  1.16046 2.154414 -0.688879
C  0.59753 -0.176707 0.867094
C  3.845928 4.304284 -0.331012
C  -0.463775 0.589552 0.285078
C  -0.1587 1.75028 -0.484969
C  5.74362 -2.051496 0.768114
C  7.40749 -0.820997 -0.448243
C  0.299115 -1.399488 1.709538
C  6.736889 -2.80189 1.407062
C  8.428066 -1.551672 0.169834
C  8.101241 -2.557647 1.11316
C  -4.055369 0.365328 0.127353
C  -5.100527 1.313136 0.370409
C  -4.466077 -0.972203 -0.181104
C  -6.792816 -0.355788 0.013861
C  -6.457826 0.977363 0.329923
C  -5.81767 -1.338178 -0.250991
H  4.467737 0.658042 1.213622
H  5.58056 1.662823 0.259091
H  5.337671 0.135803 -1.725422
H  4.098634 -0.822635 -0.861286
H  3.260679 3.050611 -2.033598
H  4.945636 2.862203 -1.540594
H  2.715431 -0.357605 1.110575
H  1.349123 3.060939 -1.268097
H  4.106459 5.166433 -0.970447
H  4.550339 4.284634 0.519625
H  2.832568 4.469432 0.071963
H  -0.990498 2.322999 -0.907258
H  4.677135 -2.209992 0.943132
H  7.603052 -0.04191 -1.188255
H  -0.369005 -2.095896 1.175333
H  -0.232573 -1.118798 2.636275
H  1.22551 -1.930069 1.991034
H  6.440155 -3.573411 2.121472
H  9.466604 -1.335447 -0.091625
H  8.88801 -3.137887 1.602198
H  -7.244443 1.707427 0.533225
H  -6.127069 -2.356139 -0.499378
