program: Gaussian 09
title: 000116760
version: EM64L-G09RevD.01
frameworkgroup: C1[X(C14H16O2)]
method: RPBEPBE
basis: SDD
operation: Freq
keyword: #pfreq=noraman
keyword: PBEPBE/SDD
title: #p freq=noraman PBEPBE/SDD
converged: YES YES NO NO
title: Mulliken charges:
elementType: O O C C C C C C C C C C C C C C H H H H H H H H H H H H H H H H
charge: -0.189241 -0.190021 -0.069769 -0.286105 -0.287518 -0.488965 -0.444754 -0.176279 0.105575 -0.220699 0.143047 -0.467914 -0.239643 -0.270615 -0.038742 -0.597171 0.243195 0.280691 0.258655 0.229681 0.225403 0.228831 0.221028 0.232125 0.208472 0.221169 0.200660 0.258948 0.260861 0.215295 0.216888 0.216914
chargesum: 0.00000
title: Mulliken charges with hydrogens summed into heavy atoms:
elementType: O O C C C C C C C C C C C C C C
charge: -0.189241 -0.190021 0.173426 -0.005415 -0.028863 -0.033881 0.005104 0.055846 0.105575 -0.012227 0.143047 -0.046086 0.019305 -0.009755 0.176553 -0.163369
polarizability: 1.85411876e+02 -4.82028126e+00 1.50756567e+02 2.03844686e+01 -2.54520883e+00 1.09754818e+02
1716.lowfreq: -14.8089 -10.2746 -6.2127 -0.0004 -0.0002 0.0002 34.9707 50.1536 58.2611
frequency: 34.9468 50.1427 58.2601 70.8003 87.7278 107.1008 136.8092 159.6987 203.2056 249.0039 256.3281 318.5622 328.8567 381.1711 399.3214 419.9556 446.2806 468.3566 475.7286 507.4726 560.4226 598.8516 636.3096 670.5964 697.3282 714.9446 757.7972 768.0996 789.7409 854.5464 878.5546 899.7893 917.1150 928.4459 942.8588 951.2122 976.3801 994.3287 1001.8608 1011.1156 1019.3989 1037.8890 1056.5312 1082.7678 1085.1963 1100.3231 1124.7157 1167.4695 1184.6039 1191.6515 1211.4555 1230.3670 1253.2183 1260.3416 1269.7707 1276.8006 1285.4013 1291.8182 1306.6772 1313.8378 1320.2466 1340.9469 1351.1175 1358.0560 1377.0706 1424.7005 1453.4602 1457.6175 1471.9308 1572.0267 1584.6501 1611.9111 1658.4146 1682.7804 2925.2558 2945.2783 2948.2405 2957.5911 2981.1907 3011.4636 3016.4309 3025.9305 3048.7091 3074.4608 3090.9022 3110.2521 3126.5534 3152.1290 3153.0926 3195.2208
redmass: 5.6672 3.3595 3.3738 3.9167 3.0600 3.0109 2.5305 4.5457 3.1618 4.2031 3.3702 3.4424 4.5285 2.9333 3.8779 4.6987 2.3434 3.9483 4.9651 3.1246 3.0874 3.4806 1.5913 3.2802 1.8230 4.0447 1.6627 2.1405 3.5592 1.8938 2.4451 2.2556 2.2045 2.1314 1.3504 2.0588 1.2370 2.5934 1.2460 1.3241 2.0790 2.5787 2.4593 2.2916 1.7578 1.9758 1.5778 1.4552 1.4282 1.4614 1.3308 1.6367 1.5486 1.5399 1.4067 1.4133 1.2834 1.2338 1.2570 1.5658 1.3228 1.6404 1.3857 1.9087 1.5749 1.1774 1.0864 1.0927 1.0997 11.3364 9.5638 7.1451 4.7461 6.8452 1.0798 1.0688 1.0644 1.0780 1.0601 1.0926 1.0878 1.0933 1.1001 1.0784 1.0756 1.0865 1.0864 1.0998 1.0976 1.1144
irintensity: 0.2225 2.1168 5.8007 2.7622 1.8387 0.5144 0.0805 1.1751 0.6248 0.9790 0.0722 2.2734 6.2638 1.7687 5.0913 2.8589 2.3504 3.0542 6.6722 1.2486 2.2718 1.2415 15.6580 7.9835 35.2924 5.1503 4.9596 4.4960 11.1227 21.7164 7.4544 15.5977 3.5229 5.7311 73.4412 13.5670 0.3011 1.7394 12.3983 0.5067 9.0609 5.4316 2.6109 10.2084 58.9623 4.2315 2.1200 8.8832 3.6613 1.3280 6.5154 14.0072 16.0611 17.2587 14.7723 12.3804 0.3957 2.0505 3.5255 10.1042 8.6305 2.7361 2.4962 7.8744 0.9502 3.4672 7.5065 3.3456 8.1616 21.0730 262.3452 6.4348 21.7633 3.1305 17.6927 14.9943 22.7554 20.2893 19.6222 9.0233 15.6161 12.7656 38.5127 37.4255 7.0286 16.0878 0.3624 19.7935 18.8128 29.8052
temp: 298.150 k
press: 1.00000 atm
elementType: 8 8 6 6 6 6 6 6 6 6 6 6 6 6 6 6 1 1 1 1 1 1 1 1 1 1 1 1 1 1 1 1
symmnumber: 1
zpe: 687182.2 jmol-1
zpe.correction: 0.261734 hartree
zpe.thermalcorrener: 0.276930 hartree
zpe.thermalcorrenthalpy: 0.277874 hartree
zpe.thermalcorrgfe: 0.218224 hartree
zpe.sumelectzpe: -692.293655 hartree
zpe.sumelectthermal: -692.278459 hartree
zpe.sumelectthermalent: -692.277515 hartree
zpe.sumelectthermalfe: -692.337164 hartree
dipole: 0.5730 0.5012 -0.2448
dipole: 0.7997
quadrupole: -101.3216 -93.7015 -100.9210
quadrupole: 8.4073 -6.1822 10.9492
quadrupole: -2.6736 4.9466 -2.2730 8.4073 -6.1822 10.9492
hfenergy: -692.5553888 hartree
pointgroup: C01 [X(C14H16O2)]
dipole: 0.2300102 -0.1920765 0.0958737 debye
polarizability: 185.2481719|5.7755347|151.0442694|-20.1103305|-2.825617|109.6308184 unknown
InChI: InChI=1S/C14H16O2/c1-2-3-5-10-6-4-7-11-12(15)8-9-13(16)14(10)11/h2,4,7-11,14H,1,3,5-6H2
charge 0 multiplicity 1
32 atoms
O  -0.033445 2.454619 -1.494849
O  -3.416251 -0.708949 1.412874
C  0.524798 -0.476595 0.009532
C  -0.606759 0.149097 -0.889365
C  -1.977498 -0.531908 -0.585751
C  0.653269 -1.981184 -0.347208
C  1.878343 0.261144 -0.14374
C  -1.868337 -2.045274 -0.582824
C  -0.680021 1.666439 -0.741659
C  -0.677311 -2.688572 -0.500053
C  -2.650385 0.000219 0.69907
C  3.015592 -0.342662 0.725919
C  -1.523288 2.209769 0.360442
C  -2.420952 1.43229 1.040481
C  4.265923 0.511878 0.700076
C  5.497546 0.089494 0.318923
H  0.197363 -0.397382 1.0689
H  -0.333219 -0.0570 -1.942523
H  -2.677264 -0.233353 -1.400609
H  1.240547 -2.49484 0.438983
H  1.246118 -2.086807 -1.281959
H  2.18702 0.256423 -1.208178
H  1.759767 1.326856 0.131769
H  -2.804942 -2.610469 -0.640018
H  -0.657416 -3.786457 -0.52751
H  3.264856 -1.365691 0.388389
H  2.649375 -0.428064 1.772219
H  -1.398919 3.277788 0.579282
H  -3.027952 1.830006 1.863433
H  4.134727 1.559861 1.014815
H  6.362664 0.762012 0.320304
H  5.675049 -0.942988 -0.008065
