program: Gaussian 09
title: 000116736
version: EM64L-G09RevD.01
frameworkgroup: C1[X(C12H20O)]
method: RPBEPBE
basis: SDD
operation: Freq
keyword: #pfreq=noraman
keyword: PBEPBE/SDD
title: #p freq=noraman PBEPBE/SDD
converged: YES YES NO NO
title: Mulliken charges:
elementType: O C C C C C C C C C C C C H H H H H H H H H H H H H H H H H H H H
charge: -0.190549 -0.401405 -0.128714 -0.473000 -0.338948 0.444688 -0.715206 -0.563561 -0.032422 -0.442136 -0.835527 -0.612695 -0.032406 0.191081 0.214191 0.225346 0.220140 0.199866 0.226668 0.226090 0.200357 0.225049 0.219006 0.219163 0.217148 0.223452 0.239742 0.240987 0.233894 0.219487 0.215086 0.212527 0.152602
chargesum: 0.00000
title: Mulliken charges with hydrogens summed into heavy atoms:
elementType: O C C C C C C C C C C C C
charge: -0.190549 0.003867 0.096631 -0.052994 -0.112280 0.444688 -0.063709 -0.125393 0.184726 0.021059 -0.141158 -0.185083 0.120196
polarizability: 1.47762013e+02 3.21171778e-01 1.11726748e+02 4.63986121e+00 -1.47784564e+00 1.30489344e+02
1716.lowfreq: -9.8990 -0.0007 -0.0005 -0.0004 7.7738 10.0582 14.2643 22.2677 35.2179
frequency: 11.8835 22.0846 35.1880 48.1553 56.2459 79.6080 106.2838 130.4653 161.9767 202.9427 212.3045 220.4986 278.0646 305.7329 315.6561 325.9871 366.1162 388.2469 445.7763 476.5743 494.2226 538.4970 568.0631 683.6471 717.5090 760.9157 791.7993 833.1201 858.0785 874.3669 898.2901 937.3301 948.6436 972.0866 980.4851 988.0256 1003.6219 1007.6331 1009.2648 1042.9984 1049.5367 1078.7742 1109.4449 1122.6992 1129.0754 1176.4487 1190.1898 1197.8224 1221.7111 1240.3919 1281.6047 1290.9442 1301.3018 1306.0524 1323.5492 1324.4599 1334.0322 1365.0178 1378.4083 1385.3086 1396.9323 1427.8037 1439.2378 1457.1197 1459.0889 1464.6929 1472.0451 1475.3309 1476.1883 1484.6020 1648.3112 1653.1348 1681.0904 2848.6008 2957.8110 2964.5130 2965.3732 2970.2613 2977.9639 2985.5994 2986.5826 3022.4349 3029.6177 3034.4369 3041.7615 3054.2769 3066.1675 3074.3707 3079.6162 3081.5623 3084.7230 3090.8141 3188.6395
redmass: 5.6451 3.9245 4.4649 3.0788 3.8553 2.6888 2.4766 2.0137 1.2987 1.2484 1.8982 2.3796 2.5436 2.2176 1.9779 2.0504 2.7215 2.0157 2.6138 2.6697 2.4994 2.2204 2.7873 1.7217 2.0431 1.6408 2.0025 1.6910 1.6961 1.8511 1.6033 1.3244 1.5825 1.3923 1.5763 1.5739 1.6796 1.5856 1.5251 2.0187 2.0348 2.1753 2.1824 2.5728 1.4875 1.4241 1.2683 1.6582 1.5700 1.4877 1.2626 1.2223 1.3632 1.3910 1.4307 1.3206 1.3973 1.3904 1.2036 1.2138 1.3014 1.1992 1.0852 1.0826 1.0900 1.0917 1.0478 1.0562 1.0621 1.0773 7.8338 4.7603 6.7939 1.0843 1.0609 1.0465 1.0532 1.0362 1.0642 1.0617 1.0809 1.1001 1.1009 1.0969 1.0997 1.0844 1.0977 1.0955 1.0916 1.0989 1.0689 1.0960 1.1141
irintensity: 1.3504 2.7500 2.5469 0.8335 4.4206 0.8599 3.1845 0.4554 0.6675 0.3437 0.6979 2.2970 2.1084 0.0867 0.4318 1.2034 1.3892 0.5886 1.4635 2.2473 5.9709 7.5046 3.7391 14.8355 5.1324 5.9067 0.8572 2.4898 10.8452 12.0317 19.0294 86.8572 3.6282 13.1274 3.2612 3.3407 8.5251 4.6965 7.8062 4.3614 9.4142 3.7321 3.9833 7.7432 2.8768 11.5823 1.7225 2.1152 0.5962 2.7862 0.9362 0.3802 0.8875 1.2743 3.8992 3.6132 3.3595 2.3949 12.5809 1.7007 21.8042 10.0711 23.3637 5.0528 4.6428 0.9000 13.1553 22.2473 8.4806 11.8040 122.4254 18.6815 2.6030 98.3871 26.6798 29.5741 22.1101 39.7111 49.8017 45.2680 12.0026 23.5675 15.5176 33.7010 31.4837 17.1445 69.0481 13.5406 21.7396 54.4505 5.7549 28.7933 36.1470
temp: 298.150 k
press: 1.00000 atm
elementType: 8 6 6 6 6 6 6 6 6 6 6 6 6 1 1 1 1 1 1 1 1 1 1 1 1 1 1 1 1 1 1 1 1
symmnumber: 1
zpe: 753323.6 jmol-1
zpe.correction: 0.286926 hartree
zpe.thermalcorrener: 0.303321 hartree
zpe.thermalcorrenthalpy: 0.304265 hartree
zpe.thermalcorrgfe: 0.239749 hartree
zpe.sumelectzpe: -543.406027 hartree
zpe.sumelectthermal: -543.389632 hartree
zpe.sumelectthermalent: -543.388688 hartree
zpe.sumelectthermalfe: -543.453204 hartree
dipole: -0.9246 -2.0443 1.3812
dipole: 2.6347
quadrupole: -74.6035 -90.4549 -79.3065
quadrupole: 1.5102 -5.3212 6.5256
quadrupole: 6.8514 -8.9999 2.1485 1.5102 -5.3212 6.5256
hfenergy: -543.6929527 hartree
pointgroup: C01 [X(C12H20O1)]
dipole: -0.4517264 -0.5470033 0.7557742 debye
polarizability: 146.9349646|0.2795101|113.0021166|5.982155|4.990989|130.0410239 unknown
InChI: InChI=1S/C12H20O/c1-4-11(2)7-5-8-12(3)9-6-10-13/h4,8,10-11H,1,5-7,9H2,2-3H3
charge 0 multiplicity 1
33 atoms
O  -1.774604 2.14494 -1.727062
C  1.562342 -1.172583 -0.765018
C  2.155143 0.213173 -0.374843
C  0.752905 -1.876328 0.363875
C  -0.440632 -1.067143 0.840314
C  -1.695435 -1.061546 0.301386
C  2.857881 0.855317 -1.600969
C  -2.773283 -0.141198 0.86989
C  3.126901 0.090517 0.784744
C  -3.23898 0.950504 -0.144075
C  -2.111869 -1.912465 -0.885623
C  3.027379 0.730605 1.977096
C  -2.08164 1.846858 -0.548426
H  2.39124 -1.840139 -1.082945
H  0.905462 -1.033515 -1.646688
H  1.319384 0.873969 -0.069167
H  1.426849 -2.062319 1.221706
H  0.428221 -2.86773 -0.008034
H  -0.250047 -0.39819 1.693905
H  3.26248 1.852043 -1.350745
H  3.698375 0.224381 -1.949815
H  2.146728 0.971134 -2.439737
H  -2.397521 0.353042 1.78703
H  -3.66557 -0.72978 1.165556
H  3.987027 -0.5782 0.607283
H  -4.007019 1.586054 0.34608
H  -3.695523 0.508865 -1.046561
H  -2.259576 -1.292201 -1.791922
H  -1.360571 -2.679999 -1.133383
H  -3.074172 -2.423668 -0.686485
H  3.778486 0.605575 2.765592
H  2.192466 1.409428 2.194823
H  -1.489129 2.250401 0.316119
