program: Gaussian 09
title: 000116411
version: EM64L-G09RevD.01
frameworkgroup: C1[X(C20H34N2O2S2)]
method: RPBEPBE
basis: SDD
operation: Freq
keyword: #p
keyword: freq=noraman
keyword: PBEPBE/SDD
title: #p freq=noraman PBEPBE/SDD
converged: YES YES NO NO
title: Mulliken charges:
elementType: S S O O N N C C C C C C C C C C C C C C C C C C C C H H H H H H H H H H H H H H H H H H H H H H H H H H H H H H H H H H
charge: 0.267632 0.267617 -0.451302 -0.451301 0.051452 0.051464 0.217849 0.217824 0.332472 0.332682 -0.436780 -0.436884 -0.229889 -0.229865 -0.392360 -0.392440 -0.705735 -0.741251 -0.705700 -0.741269 -0.751455 -0.788262 -0.751605 -0.788387 -0.246291 -0.246286 0.201989 0.205913 0.202024 0.205930 0.235433 0.203807 0.235412 0.203834 0.218451 0.232656 0.220602 0.209684 0.223797 0.232732 0.218449 0.232651 0.220599 0.209677 0.223800 0.232735 0.237418 0.242341 0.201623 0.216975 0.227042 0.223778 0.237439 0.242386 0.201643 0.216985 0.227060 0.223811 0.339690 0.339705
chargesum: 0.00000
title: Mulliken charges with hydrogens summed into heavy atoms:
elementType: S S O O N N C C C C C C C C C C C C C C C C C C C C
charge: 0.267632 0.267617 -0.111613 -0.111596 0.051452 0.051464 0.217849 0.217824 0.332472 0.332682 -0.028878 -0.028930 -0.229889 -0.229865 0.046880 0.046806 -0.034026 -0.075038 -0.034002 -0.075057 -0.070073 -0.120467 -0.070137 -0.120530 -0.246291 -0.246286
polarizability: 3.64035075e+02 1.52362539e-03 2.33188692e+02 -5.29725208e+00 3.30167707e-03 2.33438699e+02
1716.lowfreq: -0.0013 -0.0006 0.0009 3.8809 5.0350 9.4695 15.7868 22.3748 36.1116
frequency: 15.7080 22.3704 36.0916 46.8875 51.4478 55.6219 92.5329 104.6389 130.0735 130.6915 152.2474 153.5860 171.3797 175.8504 184.9105 192.4046 206.6488 208.6878 215.6209 217.2950 241.7986 245.5344 248.8806 253.1814 254.7178 263.4573 273.7322 286.2253 288.4179 292.7157 301.2704 305.7677 312.8353 324.8955 329.8909 342.5374 346.3694 359.7543 369.0458 378.8083 380.4582 403.8575 404.7435 413.0004 430.7744 438.0504 453.0341 469.7270 511.1423 549.5292 567.1900 574.2832 606.9558 607.7077 629.6108 647.3114 679.6010 727.8534 731.2533 756.8010 789.7845 812.9098 845.1097 862.6533 873.8540 890.3790 898.2114 903.7763 908.2482 934.0789 934.4129 942.6411 942.6881 960.1211 964.2505 974.3584 974.7669 979.3367 980.4344 988.2539 993.0568 1008.4027 1009.3229 1021.7653 1024.0303 1094.1145 1094.3384 1140.9411 1142.0575 1150.0879 1151.5779 1189.9038 1190.4922 1204.4683 1204.6586 1226.1610 1232.5741 1249.0508 1251.3229 1271.5452 1298.7636 1316.2532 1322.3275 1334.8588 1337.4393 1346.7960 1346.8785 1366.3939 1367.4899 1371.0692 1371.1031 1380.1008 1380.2611 1393.9445 1394.1362 1399.9360 1401.8333 1404.0951 1445.2127 1445.3796 1458.3311 1458.5119 1460.0976 1460.2730 1463.3031 1463.3969 1468.9554 1468.9651 1470.4050 1471.3139 1474.6750 1475.1014 1477.7272 1481.9222 1491.0282 1491.0647 1498.2727 1498.5197 1503.2701 1507.3764 2954.3575 2954.4374 2960.5267 2961.4686 2965.6559 2965.6732 2978.3880 2978.4835 2982.8101 2982.8585 2996.4308 2996.5505 3011.6497 3011.8424 3058.8565 3058.9249 3068.3914 3068.4391 3074.4582 3074.5117 3077.9256 3078.0669 3085.1584 3085.1927 3089.9128 3089.9669 3090.3271 3090.5002 3101.5054 3101.5712 3114.3536 3114.4108 3571.7469 3571.8621
redmass: 4.8585 4.1615 6.9401 3.3559 3.4510 8.4576 5.7826 4.1096 2.5389 2.7193 4.4177 4.1824 2.5273 2.5963 3.1933 10.6177 1.9682 1.2114 3.3833 1.6399 2.7723 1.4009 1.0442 1.1723 1.6101 1.1476 2.8644 2.5048 2.1233 2.1242 1.4283 1.3279 2.8321 1.2391 2.8207 3.2241 1.7695 1.9393 1.8166 2.1581 2.3568 1.9678 2.1965 2.6756 5.0366 13.9187 3.0182 3.1169 3.4176 4.8690 3.5763 3.6753 6.2810 6.0703 4.9933 6.3012 11.6881 3.9932 3.6305 6.7007 4.2907 3.2473 2.6908 2.0024 2.1943 2.5103 2.0241 1.5391 1.9311 1.4708 1.5034 1.4308 1.4298 2.2507 2.2249 4.1631 4.1406 1.8605 1.7948 1.9442 2.0565 1.3844 1.4720 1.4135 1.5315 1.5286 1.5320 2.0000 2.1800 1.6855 1.5367 2.3953 2.3485 2.8713 2.8999 3.0329 3.0419 2.3856 2.4638 8.8348 3.0030 1.4581 1.7424 1.3396 1.5292 1.3094 1.3026 1.1963 1.1984 1.2037 1.2008 1.1845 1.1867 1.2093 1.2103 1.7501 1.2166 2.9593 1.0957 1.0868 1.0794 1.0662 1.0703 1.0712 1.0531 1.0528 1.0538 1.0538 1.1942 1.0776 1.1502 1.0665 1.5591 1.6239 1.0532 1.0534 1.1105 1.0877 1.4489 1.9614 1.0593 1.0592 1.0636 1.0631 1.0392 1.0397 1.0346 1.0346 1.0384 1.0384 1.0364 1.0364 1.1007 1.1006 1.0986 1.0985 1.0991 1.0991 1.0977 1.0977 1.1001 1.1000 1.1009 1.1009 1.0965 1.0965 1.0996 1.0996 1.0973 1.0973 1.0983 1.0983 1.0661 1.0661
irintensity: 0.3025 0.2048 0.3084 0.9412 0.0566 0.1196 1.3139 1.0526 1.8271 6.1936 1.3818 0.2317 0.0961 0.6295 0.0397 2.4855 0.0214 3.2258 2.5589 0.2636 0.1563 10.2432 0.0940 61.3448 18.7381 0.2261 20.6266 0.0966 14.1427 0.0423 1.9654 0.0132 2.5290 128.3602 0.7981 7.3240 1.2642 32.7091 0.0048 1.1214 17.6243 5.3438 0.6086 0.0066 3.7471 0.0073 14.2274 0.3371 0.1702 0.8031 5.9072 0.1508 0.1162 14.0287 4.6649 0.0816 0.3684 1.3867 8.5144 0.0486 7.8552 0.0940 70.4140 3.2535 13.0614 3.8248 11.0827 32.1454 1.8913 27.7263 0.3397 1.5681 0.0930 16.7764 16.5266 109.7027 13.0799 0.6509 12.9258 33.8316 57.2902 0.2848 11.0057 0.7526 17.2027 17.2510 11.9181 0.8052 10.0811 0.1634 12.2522 2.1683 2.5810 2.8240 25.8571 16.2209 0.5735 9.0191 11.2607 0.0133 32.9220 5.2972 33.6846 10.8814 46.5952 3.9356 3.0471 11.8620 14.4685 36.6435 4.4278 2.2831 21.7427 37.1265 18.2106 8.1896 27.9899 3.8331 0.0790 1.2714 1.6511 2.6804 5.8329 4.0111 4.4541 0.0012 12.7754 5.9590 2.3008 0.5227 14.9851 12.7374 12.0103 24.5038 15.5448 12.0392 0.7086 9.3121 2.1735 159.2782 33.6470 6.7146 90.8854 55.7793 55.1760 11.7770 28.3217 23.9691 48.1161 3.5837 55.0228 3.5360 72.0782 3.4122 68.0381 8.3400 7.0471 26.0704 39.1734 25.1451 74.2350 1.5709 2.7267 1.0449 2.2407 16.5715 84.9604 71.1270 24.1976 24.2473 22.6865 23.7076 1.0195 11.1976
temp: 298.150 k
press: 1.00000 atm
elementType: 16 16 8 8 7 7 6 6 6 6 6 6 6 6 6 6 6 6 6 6 6 6 6 6 6 6 1 1 1 1 1 1 1 1 1 1 1 1 1 1 1 1 1 1 1 1 1 1 1 1 1 1 1 1 1 1 1 1 1 1
symmnumber: 1
zpe: 1328522.1 jmol-1
zpe.correction: 0.506007 hartree
zpe.thermalcorrener: 0.536899 hartree
zpe.thermalcorrenthalpy: 0.537843 hartree
zpe.thermalcorrgfe: 0.445711 hartree
zpe.sumelectzpe: -1836.498240 hartree
zpe.sumelectthermal: -1836.467349 hartree
zpe.sumelectthermalent: -1836.466404 hartree
zpe.sumelectthermalfe: -1836.558537 hartree
dipole: 0.0018 -1.3271 0.0000
dipole: 1.3271
quadrupole: -150.1444 -178.7137 -183.6656
quadrupole: 0.0064 -11.7194 0.0008
quadrupole: 20.6968 -7.8725 -12.8243 0.0064 -11.7194 0.0008
hfenergy: -1837.0042478 hartree
pointgroup: C01 [X(C20H34N2O2S2)]
dipole: 0.0001805 0.5221215 0.0000929 debye
polarizability: 364.2492925|0.1309655|233.1888208|-0.1474935|0.003204|233.2243518 unknown
InChI: InChI=1S/C20H34N2O2S2/c1-17(2,11-23)9-19(5,6)15-21-13-14(25-15)22-16(26-13)20(7,8)10-18(3,4)12-24/h23-24H,9-12H2,1-8H3
charge 0 multiplicity 1
60 atoms
S  1.474709 1.377992 1.558571
S  -1.463465 1.375473 -1.559159
O  2.484713 -3.113171 -0.828745
O  -2.464168 -3.118312 0.826724
N  1.411299 1.371706 -1.151339
N  -1.400036 1.368248 1.150837
C  3.792736 1.306405 -0.262991
C  -3.781324 1.298484 0.262422
C  4.190202 -1.425142 -0.043085
C  -4.172918 -1.433713 0.040875
C  4.381906 0.044482 0.477833
C  -4.367775 0.035828 -0.479166
C  2.278309 1.348865 -0.149004
C  -2.266989 1.344228 0.148479
C  2.72656 -1.695972 -0.501914
C  -2.709031 -1.701445 0.500657
C  4.371016 2.562261 0.468438
C  4.189524 1.395048 -1.759849
C  -4.362263 2.553609 -0.468248
C  -4.178321 1.385374 1.759332
C  5.170415 -1.773577 -1.195164
C  4.515361 -2.35639 1.162626
C  -5.153194 -1.785091 1.192013
C  -4.494942 -2.364983 -1.165655
C  -0.099273 1.387506 0.693127
C  0.110486 1.388034 -0.693666
H  3.99812 0.085534 1.519054
H  5.476077 0.214251 0.552972
H  -3.98404 0.078365 -1.52035
H  -5.462324 0.203221 -0.554279
H  2.501564 -1.164261 -1.440056
H  2.014114 -1.353238 0.278192
H  -2.485981 -1.169848 1.439318
H  -1.996784 -1.356534 -0.278672
H  4.166877 2.532684 1.554345
H  3.931884 3.489724 0.060386
H  5.466241 2.602109 0.32461
H  5.285439 1.297027 -1.858385
H  3.882609 2.370111 -2.176496
H  3.702551 0.615939 -2.366138
H  -4.157882 2.525185 -1.554133
H  -3.925194 3.481734 -0.059501
H  -5.457594 2.590958 -0.324551
H  -5.274041 1.284993 1.857782
H  -3.873416 2.360793 2.176607
H  -3.689774 0.606865 2.365133
H  5.060305 -1.096857 -2.057817
H  4.973146 -2.801374 -1.548925
H  6.219938 -1.718214 -0.848173
H  3.749413 -2.270862 1.958512
H  5.491692 -2.089283 1.60782
H  4.581113 -3.413309 0.845151
H  -5.045686 -1.108208 2.054878
H  -4.953449 -2.812416 1.545762
H  -6.202549 -1.732501 0.844087
H  -3.728375 -2.277443 -1.960728
H  -5.471389 -2.099721 -1.611706
H  -4.558788 -3.422206 -0.848795
H  2.444649 -3.632469 0.012953
H  -2.422001 -3.6369 -0.015305
