program: Gaussian 09
title: 000116345
version: EM64L-G09RevD.01
frameworkgroup: C1[X(C6H15N3S)]
method: RPBEPBE
basis: SDD
operation: Freq
keyword: #p
keyword: freq=noraman
keyword: PBEPBE/SDD
title: #p freq=noraman PBEPBE/SDD
converged: YES YES NO NO
title: Mulliken charges:
elementType: S N N N C C C C C C H H H H H H H H H H H H H H H
charge: 0.115480 -0.293798 -0.590749 -0.306111 -0.064806 -0.341496 -0.682559 -0.697292 -0.664169 -0.095416 0.208964 0.242289 0.206870 0.222177 0.214439 0.201659 0.228418 0.238745 0.208482 0.197396 0.274665 0.261288 0.330953 0.325722 0.258848
chargesum: 0.00000
title: Mulliken charges with hydrogens summed into heavy atoms:
elementType: S N N N C C C C C C
charge: 0.115480 -0.051509 0.065926 -0.047264 0.144158 0.087551 -0.038043 -0.052669 -0.128215 -0.095416
polarizability: 1.52014600e+02 -2.45851675e-01 1.04906032e+02 -4.71518251e+00 3.17058506e+00 7.07200995e+01
1716.lowfreq: -10.2529 -0.0023 -0.0020 0.0019 5.9624 6.2187 22.3220 35.8342 59.3863
frequency: 21.8501 35.7575 59.2940 63.3492 92.5761 131.2601 178.9234 206.1541 217.6349 255.4669 298.1049 354.7204 358.1406 395.8389 427.6941 448.6431 464.2152 486.1163 574.0723 594.6900 635.4242 712.8006 719.3252 798.0137 831.8502 911.8028 923.0166 936.9004 1002.6704 1034.3167 1052.9531 1079.9172 1097.1096 1122.3827 1134.6475 1174.8657 1216.3959 1237.5677 1263.9349 1282.1122 1311.2711 1325.9641 1365.2014 1376.1917 1389.6878 1446.4071 1454.0725 1462.8420 1464.9677 1479.9417 1484.2271 1488.6713 1591.7523 1669.9172 2902.1496 2966.5961 2972.8604 2978.9337 3013.5408 3026.3700 3061.2093 3070.2298 3071.5067 3096.2258 3098.1894 3425.6933 3452.4411 3545.2675 3701.1593
redmass: 4.4887 3.0995 4.2119 3.7601 1.9855 4.0134 2.4973 1.0777 2.8853 1.2276 3.1636 1.2187 2.6297 2.9971 4.1067 2.1615 1.3450 2.7527 3.6967 4.2942 1.6904 3.6515 1.1839 1.1798 2.1532 1.2609 1.7156 1.5432 1.2997 1.3141 3.7368 1.9915 1.7904 1.9331 2.0773 2.0775 1.7455 1.4648 2.2546 1.1679 1.4205 1.2168 1.2741 1.2707 1.2305 1.1574 1.0884 1.0556 1.0494 1.0760 1.0504 1.0840 1.2034 5.2703 1.0691 1.0354 1.0489 1.0728 1.0591 1.0872 1.0986 1.0997 1.0974 1.1002 1.1088 1.0739 1.0783 1.0447 1.1047
irintensity: 0.1293 2.0528 0.0700 1.0530 1.9433 3.1120 3.8927 0.2679 0.3146 0.4345 6.2790 73.7625 2.8708 4.9209 33.5481 14.9357 163.9996 45.4301 51.8294 81.1742 89.9399 18.6242 70.0776 5.6305 6.5127 3.8112 1.1505 0.4909 12.9022 175.1361 15.5411 9.2381 2.5381 59.4974 25.8150 89.2893 8.5992 124.9155 182.5860 6.6843 6.5373 10.8036 16.5697 8.7339 25.3936 32.3558 1.3567 3.3301 4.0739 5.0412 22.3258 2.0579 84.0384 269.5617 58.4861 27.3015 17.4067 33.1170 9.9898 19.5730 5.8783 41.2969 94.8802 33.3373 22.3436 1.0927 9.5804 54.0890 34.7971
temp: 298.150 k
press: 1.00000 atm
elementType: 16 7 7 7 6 6 6 6 6 6 1 1 1 1 1 1 1 1 1 1 1 1 1 1 1
symmnumber: 1
zpe: 559409.7 jmol-1
zpe.correction: 0.213068 hartree
zpe.thermalcorrener: 0.226695 hartree
zpe.thermalcorrenthalpy: 0.227639 hartree
zpe.thermalcorrgfe: 0.171049 hartree
zpe.sumelectzpe: -799.103508 hartree
zpe.sumelectthermal: -799.089881 hartree
zpe.sumelectthermalent: -799.088937 hartree
zpe.sumelectthermalfe: -799.145526 hartree
dipole: 1.6520 -1.6824 0.9626
dipole: 2.5469
quadrupole: -61.8833 -73.5800 -71.3420
quadrupole: 8.2029 -1.5021 -0.7133
quadrupole: 7.0518 -4.6450 -2.4069 8.2029 -1.5021 -0.7133
hfenergy: -799.3165754 hartree
pointgroup: C01 [X(C6H15N3S1)]
dipole: -0.662637 0.7187394 0.2198814 debye
dipolederiv: -0.799364 0.185948 -0.138278 0.3112014 -0.3481962 0.0925677 -0.2666703 0.1088073 -0.1723288 -1.08171 0.0474009 -0.0073461 -0.0133708 -0.6311652 -0.0277472 -0.0464792 -0.0251143 -0.116988 -1.1618055 -0.4828481 0.0722503 -0.2916125 -0.5396641 -0.0340332 0.0061742 -0.0487442 -0.7204586 -0.6281538 0.1946711 -0.0182953 0.1597504 -1.2278516 0.2210014 -0.01057 0.2836605 -0.5411041 0.7450165 -0.1114575 0.0659796 -0.0997427 0.3981157 0.0452589 0.3126596 0.0487941 0.248175 0.561447 0.1298047 -0.0576299 -0.0587821 0.3384526 0.0795431 -0.1314885 0.0256768 0.2204799 -0.1464925 0.0527832 0.0058947 0.1446654 -0.195918 -0.039937 -0.0313323 -0.0559373 0.0740848 -0.0950022 -0.0581995 0.0119485 -0.049226 -0.0715078 0.0236609 0.0069151 0.0098099 0.1012036 0.3673232 0.1078703 -0.0429104 0.3425473 0.0579378 0.0346472 -0.085731 0.0129815 0.1348151 1.6596932 0.1205279 0.2669526 -0.1176867 1.3573827 -0.3419332 0.4398663 -0.353579 0.2851371 0.001203 0.0060465 0.0573754 0.0296151 0.018511 0.0063741 0.0010085 -0.0073588 -0.1882165 0.1075887 -0.0399494 0.0261041 -0.0704056 0.2822583 -0.042997 -0.0112479 0.046216 -0.03814 -0.0419767 -0.0514818 0.0169541 -0.0929199 -0.2028934 -0.0814284 0.0065709 -0.0977049 0.0054878 0.0707697 -0.0099198 -0.0466746 -0.0058656 0.0497183 0.029597 -0.0404785 0.0457673 -0.1154897 -0.1800369 0.0785025 -0.0924602 0.0838965 0.0748168 0.0009766 -0.10741 0.0217755 0.0406609 0.0893216 0.0168147 0.0123027 -0.0011066 0.06397 0.0330448 0.0503469 -0.0355644 -0.1711423 0.0140781 -0.1473506 0.04855 -0.1297055 -0.0758474 0.0315976 0.0503955 0.0387054 0.0632008 0.0987082 0.0840313 0.0343499 0.0418058 -0.1319795 -0.0568849 0.0238567 -0.0620628 0.0704673 -0.1795072 0.0024963 -0.075158 0.0406489 0.0845315 0.0357362 -0.0922256 0.0201434 0.0551834 0.0883702 -0.0107556 -0.0142692 -0.0202141 0.0748163 -0.0328407 0.0443644 0.0287045 -0.1829938 0.0034394 -0.0165514 0.0121328 -0.0223915 -0.0884013 -0.0683971 0.0641903 -0.0414028 0.0331144 -0.0183995 -0.0232735 -0.0014995 -0.0591487 0.0360167 0.0585119 0.0084822 0.0486186 -0.0987122 0.189291 0.0168594 -0.047285 -0.0024633 0.1674902 0.0421082 -0.0751466 0.0456072 0.3764846 0.2550769 0.0626188 -0.0477973 0.0654822 0.179427 0.029584 -0.0441453 0.0058067 0.3803841 0.0811218 -0.1545884 -0.0411911 -0.1849714 0.3299794 -0.0380107 -0.0719054 -0.063606 0.256695 unknown
polarizability: 151.9343702|1.6615518|101.895385|5.1387153|-10.1641973|73.8109765 unknown
InChI: InChI=1S/C6H15N3S/c1-5(2)9-3-4-10-6(7)8/h5,7,9H,3-4,8H2,1-2H3
charge 0 multiplicity 1
25 atoms
S  1.995301 0.923581 -0.499379
N  -1.879813 -0.316617 0.259362
N  4.583261 0.655122 0.210372
N  3.428467 -1.359126 0.536996
C  -3.234193 -0.003281 -0.270964
C  -0.770211 0.556899 -0.173847
C  -3.772364 1.392824 0.149714
C  -4.201711 -1.125553 0.156328
C  0.560412 -0.187905 0.039674
C  3.432156 -0.111595 0.167334
H  -3.14683 -0.021233 -1.376801
H  -1.898153 -0.441392 1.282028
H  -0.729148 1.542811 0.346397
H  -0.904533 0.767333 -1.252151
H  -4.750949 1.598089 -0.323438
H  -3.907494 1.442193 1.247784
H  -3.077368 2.199146 -0.148334
H  -3.829124 -2.105543 -0.187707
H  -5.210047 -0.958869 -0.263081
H  -4.29852 -1.160794 1.259655
H  0.567982 -1.111762 -0.561401
H  0.711835 -0.435367 1.105611
H  5.449643 0.192363 0.479144
H  4.554896 1.665278 0.104306
H  2.552706 -1.882601 0.386401
