program: Gaussian 09
title: 000116301
version: EM64L-G09RevD.01
frameworkgroup: C1[X(C14H19NO4S)]
method: RPBEPBE
basis: SDD
operation: Freq
keyword: #p
keyword: freq=noraman
keyword: PBEPBE/SDD
title: #p freq=noraman PBEPBE/SDD
converged: YES YES NO NO
title: Mulliken charges:
elementType: S O O O O N C C C C C C C C C C C C C C H H H H H H H H H H H H H H H H H H H
charge: 0.178056 -0.276913 -0.305840 -0.287087 -0.308960 -0.138393 -0.335935 -0.339591 -0.672037 -0.667481 0.133750 0.374712 -0.564829 -0.528419 0.276061 0.259676 0.035852 -0.527478 -0.524106 -0.524158 0.259115 0.229304 0.231556 0.264163 0.256344 0.263226 0.281045 0.255851 0.288917 0.277571 0.230505 0.253157 0.225479 0.218987 0.259912 0.230706 0.254500 0.233125 0.229656
chargesum: 0.00000
title: Mulliken charges with hydrogens summed into heavy atoms:
elementType: S O O O O N C C C C C C C C C C C C C C
charge: 0.178056 -0.276913 -0.305840 -0.287087 -0.308960 -0.138393 0.152483 0.156128 -0.152466 -0.130585 0.133750 0.374712 -0.275912 -0.250848 0.276061 0.259676 0.035852 0.181663 0.185499 0.193124
polarizability: 2.59041799e+02 -1.22708824e+00 1.83247292e+02 1.56694909e+01 -4.23972402e+00 1.43099447e+02
1716.lowfreq: -13.2903 -7.4272 -3.5071 -0.0010 -0.0006 0.0018 21.2866 35.7252 47.9040
frequency: 21.0908 35.2397 47.8833 61.9933 71.9384 78.7359 86.6363 93.8205 134.7442 145.3292 156.5674 159.1698 169.8168 182.6273 196.4643 211.2803 235.9513 244.6530 280.5030 315.5818 322.5078 328.6667 364.6970 394.5447 401.4758 402.9739 429.5728 495.7091 518.3194 533.8361 578.5359 599.3296 607.5673 627.7731 635.9567 651.3264 688.6354 738.4033 773.6805 789.8990 809.6709 866.5705 888.2831 897.0940 904.3607 939.9283 949.2046 960.7519 974.8914 985.8771 1025.7464 1030.2847 1039.7666 1097.1849 1112.0533 1112.2885 1113.6374 1144.9320 1148.0578 1152.7498 1158.4178 1159.2991 1170.3643 1198.9645 1208.7109 1217.6489 1242.9508 1284.5379 1293.8471 1308.2807 1338.7861 1355.3276 1363.0544 1388.7435 1402.2268 1419.0790 1427.7612 1432.2764 1435.0349 1435.3446 1436.4658 1450.9983 1456.8693 1457.8100 1460.0244 1465.3651 1477.0346 1483.7300 1485.9771 1547.0250 1567.6048 1600.9971 2975.7037 2977.3595 2979.2618 2992.5035 2997.3543 3020.5278 3030.9338 3074.7235 3077.9194 3079.6220 3083.8025 3085.6539 3099.3324 3109.1347 3123.5194 3123.7792 3128.2709 3157.4232 3176.2593
redmass: 6.7352 4.4341 4.3786 4.7598 3.2117 3.5638 2.7420 2.9352 1.8849 1.5939 2.0872 1.6456 1.0975 3.0093 3.8389 3.3359 3.8521 5.0378 5.5920 6.5352 3.8764 3.3876 5.1285 2.4731 4.7470 3.0023 4.7905 5.5670 5.5213 3.1217 5.8892 3.7555 5.3429 4.7997 4.4420 4.4714 5.5566 5.4236 4.2778 3.8078 1.7270 6.1689 4.0985 1.4969 1.6643 7.8530 2.4762 1.6243 3.9210 2.4949 3.1876 2.8335 3.1509 2.0896 1.2392 1.2374 1.2400 1.7760 1.4019 1.3541 1.4486 1.4004 2.5710 1.4354 1.4279 1.4812 1.8379 2.2156 1.1999 1.9955 1.2415 7.3258 1.3333 2.7724 1.9698 1.3365 1.0935 1.1452 1.1724 1.1829 1.3823 1.2214 1.2053 1.0564 1.0689 1.8226 1.0610 1.0535 1.0576 8.2522 8.2257 6.9040 1.0309 1.0327 1.0300 1.0652 1.0624 1.0583 1.0583 1.1036 1.1000 1.1055 1.0998 1.0966 1.1070 1.1075 1.1032 1.1030 1.1042 1.0919 1.0923
irintensity: 0.1433 1.0478 2.2340 3.9440 2.9480 0.3884 4.8062 7.9332 0.1816 1.5152 1.2360 0.7830 0.0441 9.2488 5.0871 4.8687 4.2352 12.4683 10.5231 1.4649 2.8625 0.7041 2.7223 9.7563 7.6709 5.3314 2.1849 10.9441 2.0361 6.0061 1.2264 8.6763 7.0134 1.4502 2.6309 21.5318 5.1593 21.5156 8.2650 2.5686 2.0655 5.2321 3.6993 18.8126 31.2329 76.5421 129.1705 10.7053 59.8794 4.0316 38.4253 55.2382 96.7507 21.7369 11.7636 7.3508 3.0832 0.3175 6.5187 7.7660 14.6240 11.7863 54.5349 22.5324 19.3085 37.4696 8.7979 87.0705 23.2389 268.2894 2.5977 20.5681 20.5818 51.5286 194.1619 23.9187 17.2383 34.0043 27.2166 27.8141 15.6770 21.1518 18.5793 12.9811 2.7316 7.3146 6.2747 17.4663 26.5540 252.9829 38.3574 6.5618 61.7746 106.1697 50.6236 24.8634 45.6805 18.7153 20.5764 25.4169 4.9870 19.7993 29.4580 6.7196 16.4346 13.5486 21.3059 24.1565 16.4620 1.3788 0.7364
temp: 298.150 k
press: 1.00000 atm
elementType: 16 8 8 8 8 7 6 6 6 6 6 6 6 6 6 6 6 6 6 6 1 1 1 1 1 1 1 1 1 1 1 1 1 1 1 1 1 1 1
symmnumber: 1
zpe: 815795.8 jmol-1
zpe.correction: 0.310720 hartree
zpe.thermalcorrener: 0.332102 hartree
zpe.thermalcorrenthalpy: 0.333046 hartree
zpe.thermalcorrgfe: 0.258947 hartree
zpe.sumelectzpe: -1297.019765 hartree
zpe.sumelectthermal: -1296.998384 hartree
zpe.sumelectthermalent: -1296.997440 hartree
zpe.sumelectthermalfe: -1297.071539 hartree
dipole: 3.3380 -2.9996 0.5843
dipole: 4.5256
quadrupole: -113.4226 -127.2362 -125.8743
quadrupole: -1.1942 4.0306 3.1566
quadrupole: 8.7551 -5.0585 -3.6966 -1.1942 4.0306 3.1566
hfenergy: -1297.3304857 hartree
pointgroup: C01 [X(C14H19N1O4S1)]
dipole: 1.4463522 -0.5217804 0.8977959 debye
polarizability: 256.3547808|20.9854391|163.9482614|9.3325494|-19.8079022|165.0854962 unknown
InChI: InChI=1S/C14H19NO4S/c1-17-11-8-10(9-12(18-2)13(11)19-3)14(16)15-4-6-20-7-5-15/h8-9H,4-7H2,1-3H3
charge 0 multiplicity 1
39 atoms
S  -5.34591 0.027342 1.658144
O  -2.128244 0.028538 -2.164635
O  2.414693 -1.614412 1.313914
O  2.109315 2.755179 -1.007203
O  3.668427 0.87349 0.532136
N  -2.7012 -0.76392 -0.048625
C  -2.585499 -0.678577 1.425867
C  -4.031404 -1.173188 -0.561148
C  -3.525568 0.391449 2.020693
C  -5.135235 -0.157636 -0.217871
C  -1.792552 -0.212676 -0.958638
C  -0.378195 0.049752 -0.501247
C  0.250018 1.233914 -0.950212
C  0.369656 -0.904905 0.232556
C  1.720155 -0.652277 0.544563
C  1.594857 1.507716 -0.618186
C  2.335786 0.575159 0.164708
C  3.603513 -2.207021 0.654712
C  3.384265 2.753738 -1.760506
C  3.853941 1.09607 1.988914
H  -1.547128 -0.429444 1.694871
H  -2.83085 -1.665991 1.863704
H  -4.284315 -2.158569 -0.12513
H  -3.943202 -1.265531 -1.657111
H  -3.442504 0.407525 3.120496
H  -3.279825 1.392035 1.62436
H  -4.909645 0.831027 -0.65077
H  -6.11468 -0.502117 -0.589078
H  -0.299446 1.949373 -1.567822
H  -0.06116 -1.864665 0.534109
H  4.03231 -2.897996 1.39623
H  4.33486 -1.425459 0.382854
H  3.294673 -2.76687 -0.248049
H  3.250847 2.228838 -2.725781
H  4.187945 2.27878 -1.174292
H  3.607805 3.815969 -1.941148
H  3.548843 0.199787 2.557847
H  3.266934 1.974671 2.313418
H  4.929219 1.289902 2.121156
