program: Gaussian 09
title: 000116250
version: EM64L-G09RevD.01
frameworkgroup: C1[X(C16H23NO4)]
method: RPBEPBE
basis: SDD
operation: Freq
keyword: #p
keyword: freq=noraman
keyword: PBEPBE/SDD
title: #p freq=noraman PBEPBE/SDD
converged: YES YES NO NO
title: Mulliken charges:
elementType: O O O O N C C C C C C C C C C C C C C C C H H H H H H H H H H H H H H H H H H H H H H H
charge: -0.270382 -0.269773 -0.267902 -0.237380 -0.017133 -0.361683 -0.356669 -0.435303 -0.688234 -0.185837 -0.433932 -0.297526 0.170808 0.084477 0.237526 -0.327466 0.173427 -0.348631 -0.237266 -0.515179 -0.534955 0.187789 0.205156 0.202850 0.222252 0.223070 0.208651 0.209136 0.219139 0.202946 0.192380 0.214387 0.226030 0.231265 0.242052 0.264179 0.243403 0.228045 0.236638 0.236034 0.229796 0.247133 0.226743 0.219936
chargesum: 0.00000
title: Mulliken charges with hydrogens summed into heavy atoms:
elementType: O O O O N C C C C C C C C C C C C C C C C
charge: -0.270382 -0.269773 -0.267902 -0.237380 -0.017133 0.031262 0.068434 -0.003582 -0.057013 0.006542 0.006485 0.175791 0.170808 0.084477 0.237526 -0.063286 0.173427 -0.105229 -0.009221 0.187290 0.158857
polarizability: 2.46727169e+02 -2.40228699e+00 2.24380335e+02 -9.10972858e+00 4.01435940e+00 1.29056963e+02
1716.lowfreq: -11.0657 -7.6370 -0.0003 0.0005 0.0007 5.4572 6.5066 14.8399 34.6377
frequency: -8.6274 14.7910 34.6238 38.7759 49.3210 63.6669 74.5256 92.6781 95.3641 105.9182 111.9798 141.5762 147.7771 168.7618 177.4626 204.1374 216.3006 233.4438 235.9537 253.1539 269.1775 272.7229 292.1182 320.3864 328.1083 345.4457 397.1622 425.2139 464.6591 477.0034 489.2375 508.2902 527.3496 563.7144 584.7690 616.4650 699.9752 719.3525 733.9495 750.3102 769.2848 789.8284 795.4937 814.4199 842.2868 850.4528 878.3658 885.9680 922.7692 953.7896 956.7157 964.4609 976.5056 996.2770 1010.2204 1025.8873 1053.9392 1077.8089 1080.0522 1084.0097 1105.4250 1106.3324 1108.4865 1112.3330 1150.8735 1155.1104 1157.4666 1188.9483 1204.4120 1206.2267 1213.8764 1227.2258 1241.9677 1256.7026 1266.2760 1287.7857 1302.3063 1310.7585 1334.5556 1355.3372 1361.7165 1372.1383 1374.4507 1385.0791 1415.1075 1430.1548 1433.9674 1449.2379 1452.1057 1455.6603 1458.2213 1466.7384 1466.8421 1467.4256 1468.7220 1476.1949 1476.4987 1477.3568 1488.9805 1578.4724 1594.5626 1624.5741 1657.3274 2891.4269 2931.2725 2960.0735 2961.8045 2967.6877 2974.8350 2979.6031 2983.9363 3009.0472 3018.7048 3033.7365 3040.6197 3051.0503 3060.1099 3064.1252 3072.0139 3086.5494 3121.8707 3126.3629 3127.7939 3140.4634 3162.1958 3188.2039
redmass: 3.3887 4.3717 4.8048 4.2178 3.7030 5.4562 2.9303 3.6789 3.5803 1.9634 3.0040 1.8966 1.4606 4.3429 2.8955 2.3900 2.8376 1.2134 2.0124 2.9875 2.0052 3.2942 4.3929 5.5493 4.3860 2.7791 2.5509 6.4354 4.0578 3.9129 3.1739 2.4210 4.2148 3.7627 5.6853 4.9857 6.5850 5.9718 1.1176 1.7144 4.8194 3.1976 2.0383 4.2556 1.7084 1.9223 2.4474 1.4211 2.2297 5.1686 1.9785 1.3338 1.6042 3.9784 2.5072 3.2730 2.7496 2.4374 2.2095 2.1605 1.7147 1.8161 2.2354 1.2588 1.3762 1.3494 2.1517 1.2775 1.2894 3.7579 1.2062 1.3452 2.0501 3.3501 1.1493 1.1599 1.2707 1.2646 1.2931 1.5090 1.2907 1.4387 6.3458 1.2174 1.4026 1.3115 1.1424 1.0951 1.8597 1.1058 1.9909 1.0690 1.0638 1.0540 1.0816 1.1203 1.0449 1.0962 1.0864 6.1591 7.5201 10.4010 7.6148 1.0852 1.0643 1.0601 1.0329 1.0367 1.0639 1.0605 1.0292 1.0974 1.0901 1.1016 1.0635 1.1040 1.0983 1.1000 1.0995 1.1056 1.1070 1.1028 1.0995 1.0869 1.0941 1.0951
irintensity: 0.4985 0.0294 0.8177 1.4758 1.1814 1.0551 4.9863 15.7518 3.2156 2.6438 5.2759 3.1233 1.2113 1.4215 0.4057 2.3675 4.9057 0.1187 0.6028 0.9397 3.4511 2.3297 4.5722 6.8533 10.2168 5.6017 13.4630 4.7617 3.3229 7.9446 0.3522 2.7210 11.8644 3.3244 2.0949 4.3515 11.5551 3.2122 16.4215 44.3878 8.9734 42.5918 2.9447 4.0842 6.2095 1.7584 33.4234 2.1808 3.8243 42.8087 19.3750 1.0344 6.2201 158.3568 52.3563 138.3057 6.8927 8.9238 30.7888 8.9570 15.7003 4.7127 43.8690 0.1559 6.6126 9.0851 2.4458 3.6594 4.6252 80.3382 28.7225 1.6404 21.3699 407.4510 3.2823 2.6203 0.6359 0.6322 12.5720 0.3991 3.4203 3.0506 25.2564 8.8057 36.0892 15.2773 27.8940 19.2396 17.1023 18.9026 167.5602 3.0334 2.3498 15.8777 16.4602 4.9792 14.4570 3.3895 14.7420 26.1832 3.3202 188.7633 60.1452 64.8715 57.1927 16.8590 66.8945 44.1838 23.7937 44.0667 66.1887 7.4297 12.9452 27.4369 53.8339 44.3279 9.3531 155.5014 49.1882 24.4621 7.5267 21.5252 24.2573 7.5096 14.6119 2.5606
temp: 298.150 k
press: 1.00000 atm
elementType: 8 8 8 8 7 6 6 6 6 6 6 6 6 6 6 6 6 6 6 6 6 1 1 1 1 1 1 1 1 1 1 1 1 1 1 1 1 1 1 1 1 1 1 1
symmnumber: 1
zpe: 951339.7 jmol-1
zpe.correction: 0.362346 hartree
zpe.thermalcorrener: 0.384896 hartree
zpe.thermalcorrenthalpy: 0.385840 hartree
zpe.thermalcorrgfe: 0.308651 hartree
zpe.sumelectzpe: -977.476574 hartree
zpe.sumelectthermal: -977.454024 hartree
zpe.sumelectthermalent: -977.453080 hartree
zpe.sumelectthermalfe: -977.530269 hartree
dipole: -1.4206 3.6622 2.2353
dipole: 4.5196
quadrupole: -109.2051 -116.7280 -126.4807
quadrupole: -9.3571 -2.2111 0.0425
quadrupole: 8.2661 0.7432 -9.0094 -9.3571 -2.2111 0.0425
hfenergy: -977.8389201 hartree
pointgroup: C01[X(C16H23N1O4)]
dipole: -0.7760614 -1.5812985 -0.2429617 debye
polarizability: 241.9222268|9.1854654|203.5719432|23.2633854|-38.3690004|154.6702974 unknown
InChI: InChI=1S/C16H23NO4/c1-4-5-6-10-17-11-12-21-16(18)13-8-7-9-14(19-2)15(13)20-3/h7-10H,4-6,11-12H2,1-3H3
charge 0 multiplicity 1
44 atoms
O  1.119416 1.369436 0.310361
O  -2.626207 1.823965 -1.356574
O  -4.544148 -0.12587 -1.091604
O  0.202828 2.039044 -1.72976
N  4.082354 0.591385 -0.026616
C  3.669157 -2.82037 0.903835
C  2.823025 -2.281997 2.080404
C  4.677197 -1.774806 0.347366
C  1.751927 -3.289054 2.550806
C  3.983632 -0.652946 -0.390793
C  3.349658 1.613337 -0.80532
C  2.269438 2.2828 0.059728
C  -0.95184 0.370716 -0.344133
C  -2.275682 0.586003 -0.813761
C  -3.270157 -0.417837 -0.584291
C  -0.641937 -0.800443 0.400065
C  0.12823 1.343878 -0.688111
C  -2.942264 -1.592734 0.129371
C  -1.63033 -1.772215 0.628419
C  -2.954515 1.859568 -2.797431
C  -5.622559 -1.072783 -0.795722
H  2.996212 -3.154391 0.085979
H  4.227203 -3.719175 1.234257
H  3.496681 -2.03078 2.924077
H  2.343483 -1.328422 1.78395
H  5.280614 -1.3433 1.166244
H  5.370104 -2.282502 -0.355316
H  2.215023 -4.237418 2.883421
H  1.161727 -2.886324 3.394319
H  1.050989 -3.532707 1.728753
H  3.368673 -0.96605 -1.269463
H  2.883169 1.227355 -1.739735
H  4.073059 2.40438 -1.085414
H  1.896239 3.19692 -0.433748
H  2.659908 2.503509 1.065042
H  0.373104 -0.930374 0.781817
H  -3.699942 -2.359994 0.315458
H  -1.38787 -2.676814 1.195872
H  -2.047092 1.633966 -3.386056
H  -3.771575 1.154158 -3.030249
H  -3.27774 2.893223 -2.990698
H  -6.52225 -0.629965 -1.247048
H  -5.767927 -1.184236 0.296086
H  -5.426316 -2.064038 -1.249089
