program: Gaussian 09
title: 000116207
version: EM64L-G09RevD.01
frameworkgroup: C1[X(C14H14Cl4N4S2)]
method: RPBEPBE
basis: SDD
operation: Freq
keyword: #p
keyword: freq=noraman
keyword: PBEPBE/SDD
title: #p freq=noraman PBEPBE/SDD
converged: YES YES NO NO
title: Mulliken charges:
elementType: Cl Cl Cl Cl S S N N N N C C C C C C C C C C C C C C H H H H H H H H H H H H H H
charge: 0.017002 0.036020 0.036115 0.017053 0.208578 0.208530 -0.404174 -0.402501 -0.095325 -0.095192 0.831441 0.831405 -0.839320 -0.839243 -0.376260 -0.377321 -0.468175 -0.468018 -0.363660 -0.375626 -0.375635 -0.363619 -0.046784 -0.047392 0.300492 0.352307 0.300509 0.352271 0.230779 0.225730 0.231010 0.225564 0.231170 0.232279 0.231167 0.232259 0.303485 0.303078
chargesum: 0.00000
title: Mulliken charges with hydrogens summed into heavy atoms:
elementType: Cl Cl Cl Cl S S N N N N C C C C C C C C C C C C C C
charge: 0.017002 0.036020 0.036115 0.017053 0.208578 0.208530 -0.100689 -0.099423 -0.095325 -0.095192 0.831441 0.831405 -0.186521 -0.186462 0.080249 0.079254 -0.004726 -0.004592 -0.363660 -0.375626 -0.375635 -0.363619 -0.046784 -0.047392
polarizability: 4.02316171e+02 3.16492856e+01 2.33787107e+02 4.00740488e-02 -2.06092266e-02 1.76964742e+02
1716.lowfreq: -2.4064 0.0020 0.0026 0.0030 3.7506 7.4517 15.6218 17.7066 21.8312
frequency: 15.6195 17.7057 21.7878 26.9414 33.2088 45.8816 58.3506 63.0173 65.8994 90.9988 98.0192 101.5289 105.1451 110.4431 132.3245 195.3171 198.8954 209.6249 213.1893 214.1264 231.0592 292.2086 301.7001 310.7959 324.3824 336.2234 339.5417 343.3828 359.9223 363.6622 398.0300 435.3376 446.6897 475.1127 507.0491 577.4463 587.5677 587.8569 594.8530 599.4584 604.2485 637.2936 717.7742 720.5404 725.8806 785.4289 804.6976 823.8312 825.8777 826.9943 869.9518 870.7313 904.5330 922.1593 937.2662 937.5322 956.8232 957.0760 976.3259 1024.1272 1024.3383 1076.3157 1076.5636 1098.0738 1144.9918 1164.1799 1165.7152 1166.8539 1179.1307 1181.8088 1208.1884 1208.4675 1250.2834 1252.6886 1257.0687 1271.9541 1272.3140 1287.9475 1288.3797 1336.6588 1347.1839 1395.9316 1421.0496 1421.8812 1459.6561 1459.7564 1469.8963 1470.1172 1500.7451 1500.8417 1515.1383 1561.5651 1561.8150 1565.1825 2974.0693 2974.8605 3004.2612 3004.8356 3013.9629 3014.3427 3036.8295 3038.6031 3066.1472 3066.8092 3130.7451 3130.8949 3595.6223 3597.7432
redmass: 6.2696 5.6293 5.4449 8.0648 6.2006 3.9579 4.5031 32.8812 9.2940 2.8381 2.8825 8.1389 7.3306 7.8903 14.6684 4.4263 4.0845 9.3073 20.5135 24.3298 14.7636 5.6247 6.0712 10.7565 26.8881 1.2363 10.6441 1.2523 3.3594 3.5820 5.3734 11.2507 9.3614 9.5734 5.9518 3.9448 5.6674 5.6643 9.7139 12.0463 6.4417 8.8122 5.6123 4.8090 6.3745 8.3112 11.8579 7.1201 1.2966 1.3167 5.9461 6.0394 1.7016 1.7204 3.8379 3.7709 5.3158 5.1771 7.6426 3.8780 3.8731 1.6066 1.6073 7.9400 1.2253 1.2009 1.1280 1.1424 2.4715 2.0141 1.1001 1.0974 2.6135 1.1905 1.7534 1.4123 1.4134 1.2600 1.2578 8.6715 4.8357 9.4577 1.8409 1.8503 1.0974 1.1043 1.1206 1.1208 1.1010 1.1013 8.2160 6.0573 6.3823 9.9719 1.0622 1.0616 1.0640 1.0637 1.0665 1.0664 1.1005 1.0998 1.1064 1.1061 1.0994 1.0994 1.0799 1.0799
irintensity: 0.4582 3.2762 0.1636 0.5586 0.0256 11.2151 0.2103 0.0019 8.8412 0.5031 0.4444 0.0879 0.0089 4.7728 5.7425 0.1171 20.8868 0.0232 0.0192 0.5716 7.2816 8.9863 3.6162 2.6591 0.1913 160.5522 0.8036 151.2774 3.2935 7.8427 0.3511 14.7849 0.1562 37.2999 0.1651 0.6144 1.3723 1.9221 6.7440 0.0651 61.5888 19.3820 0.1314 3.1738 1.8757 0.8946 0.2185 3.6413 2.1511 2.2391 42.9870 6.6342 37.0278 1.1970 34.8505 25.8651 17.8285 4.4502 0.0067 5.7397 6.5039 0.2821 0.3163 158.8361 36.7024 7.7892 3.8339 10.5218 214.8262 21.4008 0.8609 0.7366 0.7787 20.2679 0.2048 65.8013 96.8397 44.9561 20.8510 114.4748 42.8238 6.4633 245.7448 74.4541 16.2297 23.7248 0.9956 0.9506 11.4993 9.2747 2.3176 157.8794 145.7693 32.0015 78.6599 74.8023 95.3702 74.8367 79.5899 12.9370 38.6570 38.5080 46.2856 46.9500 27.7260 2.4888 27.4990 29.2679
temp: 298.150 k
press: 1.00000 atm
elementType: 17 17 17 17 16 16 7 7 7 7 6 6 6 6 6 6 6 6 6 6 6 6 6 6 1 1 1 1 1 1 1 1 1 1 1 1 1 1
symmnumber: 1
zpe: 690674.8 jmol-1
zpe.correction: 0.263064 hartree
zpe.thermalcorrener: 0.288745 hartree
zpe.thermalcorrenthalpy: 0.289689 hartree
zpe.thermalcorrgfe: 0.201252 hartree
zpe.sumelectzpe: -3395.439562 hartree
zpe.sumelectthermal: -3395.413881 hartree
zpe.sumelectthermalent: -3395.412937 hartree
zpe.sumelectthermalfe: -3395.501374 hartree
dipole: 0.0163 -0.0184 3.3008
dipole: 3.3009
quadrupole: -130.8375 -188.0815 -174.2492
quadrupole: 13.2802 0.0692 -0.0605
quadrupole: 33.5519 -23.6921 -9.8598 13.2802 0.0692 -0.0605
hfenergy: -3395.7026263 hartree
pointgroup: C01 [X(C14H14Cl4N4S2)]
dipole: -0.006049 0.0072005 1.29865 debye
polarizability: 402.9460864|29.9185035|233.1571576|-0.0906316|0.0189423|176.9647762 unknown
InChI: InChI=1S/C14H14Cl4N4S2/c15-9-7(5-23-13-19-1-2-20-13)10(16)12(18)8(11(9)17)6-24-14-21-3-4-22-14/h19,21H,1-6H2
charge 0 multiplicity 1
38 atoms
Cl -0.418234 3.183983 -0.724511
Cl 2.534828 1.963634 -0.745398
Cl -2.53444 -1.964446 -0.743415
Cl 0.418706 -3.184772 -0.724181
S  -3.456847 1.243779 0.987663
S  3.457965 -1.244699 0.985837
N  -5.939392 0.274413 1.732506
N  5.941797 -0.277598 1.730115
N  -5.534947 0.172417 -0.53664
N  5.535637 -0.173302 -0.539004
C  -1.344514 0.549016 -0.76084
C  1.344881 -0.549822 -0.761616
C  -2.736453 1.120072 -0.784794
C  2.736791 -1.120906 -0.786382
C  -7.146661 -0.438305 1.242936
C  7.143576 0.444797 1.240235
C  -6.917467 -0.382968 -0.318476
C  6.91958 0.378652 -0.321051
C  -0.194392 1.383706 -0.7522
C  1.111643 0.851501 -0.755481
C  -1.111275 -0.85234 -0.754613
C  0.194761 -1.384531 -0.752078
C  -5.085167 0.496277 0.652129
C  5.086268 -0.497643 0.649776
H  -2.751709 2.137235 -1.196582
H  -3.466643 0.484385 -1.316187
H  2.751913 -2.138026 -1.19828
H  3.466699 -0.485124 -1.318015
H  -8.073601 0.077323 1.55084
H  -7.17814 -1.479094 1.62148
H  8.07476 -0.059165 1.554015
H  7.16251 1.488236 1.612714
H  -6.996201 -1.379374 -0.786651
H  -7.650206 0.282868 -0.809892
H  7.004444 1.370765 -0.796958
H  7.650963 -0.294668 -0.804511
H  -5.647877 0.284635 2.708105
H  5.646543 -0.279909 2.704801
