program: Gaussian 09
title: 000116170
version: EM64L-G09RevD.01
frameworkgroup: C1[X(C18H34N2)]
method: RPBEPBE
basis: SDD
operation: Freq
keyword: #pfreq=noraman
keyword: PBEPBE/SDD
title: #p freq=noraman PBEPBE/SDD
converged: NO YES NO NO
title: Mulliken charges:
elementType: N N C C C C C C C C C C C C C C C C C C H H H H H H H H H H H H H H H H H H H H H H H H H H H H H H H H H H
charge: -0.347820 -0.348483 -0.038560 -0.037114 -0.420393 -0.465191 -0.464783 -0.420783 0.005276 0.006174 -0.460128 -0.417668 -0.417418 -0.460472 -0.394473 -0.396940 -0.396949 -0.394548 -0.385555 -0.385466 0.193067 0.192068 0.202775 0.181805 0.176278 0.221119 0.220968 0.176496 0.181887 0.202686 0.169063 0.168573 0.225350 0.225333 0.210133 0.180609 0.194674 0.207005 0.207003 0.194369 0.180759 0.210040 0.197278 0.191089 0.188912 0.196588 0.196629 0.188916 0.191122 0.197306 0.195151 0.190544 0.195148 0.190553
chargesum: 0.00000
title: Mulliken charges with hydrogens summed into heavy atoms:
elementType: N N C C C C C C C C C C C C C C C C C C
charge: -0.122470 -0.123151 0.154507 0.154953 -0.035812 -0.067794 -0.067319 -0.036209 0.174339 0.174747 -0.069386 -0.015989 -0.016046 -0.069674 -0.006106 -0.011440 -0.011405 -0.006120 0.000140 0.000235
polarizability: 2.64068018e+02 -5.72675032e-01 1.81367035e+02 -4.33200603e+00 -5.79267177e-01 1.66225615e+02
1716.lowfreq: -30.5783 -21.6562 -10.7755 -5.4125 -0.0010 0.0007 0.0013 20.0859 29.6341
frequency: -22.0767 14.0730 29.5784 34.7950 55.7170 79.3894 128.6946 138.3198 140.9668 203.4688 209.5981 217.1396 218.2939 236.3193 270.4716 309.0117 312.8507 324.8108 333.3328 394.6522 407.3783 411.6580 428.0287 438.9806 439.9941 452.0719 464.6970 471.8576 513.6489 523.5574 556.2647 621.0391 652.4159 657.6977 773.6227 778.8067 779.2079 782.5443 786.8758 797.1613 842.5388 843.7107 863.7226 875.5948 875.8885 893.8500 894.7447 899.3174 916.3651 918.7051 940.7468 961.1235 965.1528 973.8606 1026.3679 1038.6132 1045.3203 1047.8248 1048.9967 1049.9024 1055.6280 1057.4310 1071.2045 1092.9626 1098.8846 1109.6408 1110.7844 1125.0790 1136.3291 1140.7276 1146.1945 1146.2447 1150.0884 1175.1250 1201.6012 1207.9990 1235.4043 1236.9577 1237.5949 1239.1078 1249.2512 1251.7991 1256.0924 1256.3438 1284.1574 1288.2760 1295.0705 1297.1382 1306.9523 1308.3489 1308.7467 1311.1968 1326.2795 1329.2198 1332.5909 1333.0883 1336.4306 1340.3693 1340.9783 1341.3468 1341.5519 1344.3503 1354.8617 1359.5783 1362.8060 1366.4407 1456.8433 1457.1065 1458.4064 1458.9918 1461.8988 1462.4194 1463.1193 1463.6029 1464.6700 1467.8134 1470.3463 1470.5609 1470.8326 1471.8761 1478.4667 1478.5476 2835.2452 2835.5524 2944.9740 2948.1246 2951.6144 2952.8889 2958.5118 2958.9179 2962.6977 2962.9237 2966.9613 2967.1061 2967.9202 2968.0383 2973.7970 2973.9597 2980.1019 2980.4447 3016.9959 3017.2703 3024.5221 3024.7743 3026.9837 3027.2128 3028.0017 3028.3030 3034.4510 3034.5308 3041.1973 3042.4846 3043.8002 3044.0239 3398.9797 3399.0156
redmass: 3.3984 2.8191 3.4414 3.4853 3.3721 3.7974 3.2091 3.0041 3.0520 3.4091 1.8454 1.7750 1.8314 2.5805 3.0812 3.3341 2.0262 1.9044 2.2341 1.9826 2.9420 2.4472 2.3166 2.6016 2.6873 2.6537 2.0148 1.7753 3.5158 1.8850 1.9394 1.8113 1.8138 1.9794 1.8394 1.9437 1.8243 1.6384 1.7967 1.8746 2.1073 2.0910 2.1738 1.6956 1.6925 1.5621 1.5318 1.3792 1.8346 1.8920 1.9247 2.5012 1.9826 2.4197 3.0600 1.6729 1.8103 1.2842 1.5842 1.3106 1.1017 1.5798 1.5447 1.7790 2.6640 2.2951 2.3663 1.9812 3.3430 3.9708 2.4759 2.4444 2.0595 1.3856 1.7502 1.3460 1.3787 1.3032 1.3423 1.4044 1.2583 1.2600 1.2573 1.2514 1.1902 1.2704 1.3046 1.2282 1.3235 1.2555 1.2999 1.2876 1.3869 1.4229 1.3632 1.3662 1.5279 1.5243 1.4471 1.4520 1.4830 1.4589 1.5635 1.5537 1.5091 1.4873 1.1022 1.1203 1.1059 1.1189 1.0982 1.0960 1.0886 1.0904 1.0968 1.1947 1.0956 1.0946 1.1388 1.0968 1.0966 1.0964 1.0794 1.0795 1.0683 1.0674 1.0645 1.0630 1.0596 1.0595 1.0630 1.0630 1.0601 1.0603 1.0661 1.0660 1.0660 1.0660 1.0741 1.0764 1.0990 1.0990 1.0977 1.0977 1.0957 1.0961 1.0984 1.0981 1.1025 1.1026 1.0949 1.0977 1.1031 1.1030 1.0734 1.0733
irintensity: 0.1946 0.0020 0.0147 0.1442 0.0002 0.0001 1.4149 1.4923 0.0759 0.0005 0.6436 0.3500 0.0420 0.0001 2.9807 1.8221 0.0016 4.0236 0.0056 3.8872 0.0001 0.0019 6.5562 0.0563 2.1116 0.0009 17.1586 0.0037 0.0115 26.2628 0.0010 31.1556 0.0156 117.3612 0.0002 0.0297 1.3560 0.0003 0.1392 0.0007 5.5655 11.8463 18.9379 5.8479 0.2931 14.9695 3.1541 11.9814 2.1831 0.0213 10.1704 0.0081 6.2321 7.6731 0.0004 0.0014 1.0873 0.0069 0.1410 2.3540 0.0462 3.2597 0.0024 3.3858 3.8447 0.9364 2.3191 0.0387 2.4297 160.3836 21.8028 2.5467 0.0400 1.0426 0.0014 2.9615 2.6741 0.0023 0.0055 4.0966 5.3525 0.0011 4.5508 0.4438 0.0010 2.2268 0.1492 0.0048 0.0561 6.2187 4.0990 0.0072 6.0906 0.0632 0.9817 0.8065 0.1563 23.0293 2.1575 3.7531 1.3720 0.2522 0.0009 16.0104 0.0255 43.3804 1.8175 4.4065 9.4214 0.0011 19.5474 0.2682 4.7613 0.0608 11.6714 0.2987 21.3233 9.0504 58.0443 0.0150 3.0152 1.8668 0.5114 128.8083 29.6882 0.1604 53.5261 0.0892 37.6285 42.8771 32.0281 36.9564 38.6214 47.0738 60.9386 22.3499 9.8230 3.8682 99.5263 11.7442 51.6650 68.2194 71.0832 72.4244 66.6617 47.5654 33.2942 57.9821 1.4153 0.7815 0.8708 158.8900 45.6271 193.5072 1.2388 7.6161
temp: 298.150 k
press: 1.00000 atm
elementType: 7 7 6 6 6 6 6 6 6 6 6 6 6 6 6 6 6 6 6 6 1 1 1 1 1 1 1 1 1 1 1 1 1 1 1 1 1 1 1 1 1 1 1 1 1 1 1 1 1 1 1 1 1 1
symmnumber: 1
zpe: 1299667.4 jmol-1
zpe.correction: 0.495017 hartree
zpe.thermalcorrener: 0.514577 hartree
zpe.thermalcorrenthalpy: 0.515521 hartree
zpe.thermalcorrgfe: 0.446015 hartree
zpe.sumelectzpe: -814.185609 hartree
zpe.sumelectthermal: -814.166050 hartree
zpe.sumelectthermalent: -814.165106 hartree
zpe.sumelectthermalfe: -814.234612 hartree
dipole: -0.0093 0.0081 0.0030
dipole: 0.0127
quadrupole: -124.7174 -123.6227 -129.4054
quadrupole: -0.4381 -5.4262 -2.7817
quadrupole: 1.1978 2.2925 -3.4903 -0.4381 -5.4262 -2.7817
hfenergy: -814.6806264 hartree
pointgroup: C01 [X(C18H34N2)]
dipole: -0.0036248 -0.0033811 -0.0007408 debye
polarizability: 264.0523594|2.2378903|180.9777619|3.900795|-2.5443648|166.6305464 unknown
InChI: InChI=1S/C18H34N2/c1-3-7-15(8-4-1)19-17-11-13-18(14-12-17)20-16-9-5-2-6-10-16/h15-20H,1-14H2
charge 0 multiplicity 1
54 atoms
N  2.750678 -0.902725 -0.350934
N  -2.754021 0.916337 0.327452
C  1.471464 -0.149289 -0.333479
C  -1.471212 0.168967 0.30791
C  0.968438 0.25828 1.083518
C  0.385665 -0.981129 -1.054749
C  -0.386213 1.003355 1.027227
C  -0.968999 -0.236277 -1.109917
C  3.977432 -0.235414 0.155972
C  -3.979705 0.235683 -0.164424
C  5.113752 -1.284068 0.227035
C  4.397073 0.938194 -0.763055
C  -4.389676 -0.925312 0.774764
C  -5.122513 1.276356 -0.247645
C  6.44888 -0.659124 0.695065
C  5.728648 1.57665 -0.298546
C  -5.717891 -1.580054 0.323678
C  -6.454906 0.635463 -0.702242
C  6.859847 0.524521 -0.212699
C  -6.856129 -0.536711 0.224609
H  1.623197 0.77976 -0.920814
H  -1.618402 -0.760789 0.895269
H  1.723903 0.888873 1.591641
H  0.85687 -0.664048 1.694164
H  0.253917 -1.944681 -0.514571
H  0.741414 -1.230856 -2.071607
H  -0.741768 1.254566 2.043775
H  -0.255028 1.965984 0.485358
H  -0.857976 0.686962 -1.719255
H  -1.724392 -0.866501 -1.618589
H  3.842043 0.178542 1.189382
H  -3.846013 -0.193626 -1.191762
H  2.628919 -1.826124 0.09335
H  -2.640757 1.835864 -0.127012
H  5.236161 -1.72657 -0.782436
H  4.818243 -2.108678 0.909331
H  3.603855 1.71049 -0.789418
H  4.499382 0.542149 -1.793372
H  -4.492636 -0.512675 1.798466
H  -3.591304 -1.69176 0.812505
H  -4.834397 2.092384 -0.943258
H  -5.245065 1.73308 0.755446
H  7.243032 -1.430721 0.703531
H  6.341924 -0.297997 1.739078
H  5.586255 2.0397 0.700515
H  6.015089 2.393244 -0.989368
H  -5.997088 -2.387682 1.027839
H  -5.574756 -2.057407 -0.668504
H  -6.348058 0.258758 -1.740746
H  -7.254062 1.4017 -0.720749
H  7.790675 0.991008 0.164983
H  7.079682 0.143006 -1.231246
H  -7.784865 -1.014738 -0.143648
H  -7.075908 -0.141125 1.237779
