program: Gaussian 09
title: 000015110
version: EM64L-G09RevD.01
frameworkgroup: C1[X(C18H14O7)]
method: RPBEPBE
basis: SDD
operation: Freq
keyword: #pfreq=noraman
keyword: PBEPBE/SDD
title: #p freq=noraman PBEPBE/SDD
converged: YES YES NO NO
title: Mulliken charges:
elementType: O O O O O O O C C C C C C C C C C C C C C C C C C H H H H H H H H H H H H H H
charge: -0.356662 -0.290356 -0.290376 -0.189499 -0.189536 -0.200814 -0.200810 0.134465 0.134302 0.300603 0.300675 -0.306792 -0.306838 -0.358552 -0.358597 0.221325 0.221635 -0.239075 -0.239009 -0.195285 -0.195274 0.266592 0.266769 -0.748410 -0.748536 0.276347 0.276452 0.258568 0.258576 0.239365 0.239370 0.238928 0.238940 0.280541 0.242809 0.247418 0.280437 0.242836 0.247465
chargesum: 0.00000
title: Mulliken charges with hydrogens summed into heavy atoms:
elementType: O O O O O O O C C C C C C C C C C C C C C C C C C
charge: -0.356662 -0.290356 -0.290376 -0.189499 -0.189536 -0.200814 -0.200810 0.134465 0.134302 0.300603 0.300675 -0.030444 -0.030386 -0.099984 -0.100021 0.221325 0.221635 0.000290 0.000361 0.043643 0.043666 0.266592 0.266769 0.022358 0.022202
polarizability: 2.75406824e+02 -2.32457727e+01 1.90411655e+02 -5.63118996e-02 -7.52456695e-02 2.09292125e+02
1716.lowfreq: -0.0004 0.0003 0.0003 2.2281 3.2859 9.0448 15.4674 16.1647 30.7953
frequency: 15.4588 16.1569 30.7951 53.8249 54.0348 80.0743 80.8877 89.6878 90.7277 100.2970 112.0105 113.2606 113.8107 142.0777 143.6013 189.1705 221.1037 251.6466 261.3334 268.9314 295.2525 302.2742 354.4747 399.8653 409.2283 429.8030 434.7607 450.7296 481.9306 503.4007 509.6384 533.6417 535.3123 538.9046 551.2879 607.6128 633.1528 637.6322 651.5806 671.1022 675.5493 698.1881 727.2959 751.0711 762.9402 775.2719 784.2444 792.5305 803.0929 859.4430 868.0572 891.2691 893.0751 938.6588 962.3133 972.3341 974.0781 987.1783 988.0742 1000.4694 1001.4541 1037.4215 1037.6737 1038.6848 1039.2171 1106.1751 1113.0006 1149.4372 1150.9222 1172.5716 1175.0580 1189.0111 1194.6831 1207.7698 1247.7788 1269.9302 1274.8030 1379.0170 1379.3014 1384.8255 1386.3848 1432.8225 1433.0445 1449.2570 1449.3423 1453.8391 1454.0051 1466.1524 1468.6260 1574.6677 1575.2984 1610.0420 1611.6547 1627.9490 1682.0387 1695.8686 1696.2371 3009.4655 3009.4766 3103.5408 3103.5695 3143.1475 3143.1616 3144.0333 3144.0502 3160.8613 3160.8897 3175.4187 3175.4581 3186.7667 3186.8066
redmass: 5.3521 7.0635 6.0880 6.1925 5.5896 3.7323 4.8025 5.1476 5.5550 4.2468 4.0627 1.1732 1.1549 7.1469 7.1844 10.5351 8.0663 7.3277 6.0563 7.2708 4.1773 3.8993 6.8876 8.1065 6.4427 3.7056 4.1152 4.7381 4.8861 3.9812 4.3488 3.7493 5.1638 3.5420 5.4345 7.9375 5.7109 5.5172 5.9410 4.9146 5.7625 5.5667 4.9209 3.4198 3.6033 2.6224 2.1676 2.2494 3.3405 5.6530 5.0430 1.6142 1.5674 9.6687 7.5633 1.3797 1.3791 2.1802 2.1661 1.3469 1.3452 1.8767 1.7573 1.8875 1.9684 2.2285 2.1044 2.8930 2.7621 1.1354 1.0738 2.6389 2.8939 3.0580 3.2895 1.4699 1.5705 1.2411 1.2466 10.9337 10.5444 2.2668 2.2773 1.0587 1.0586 1.0522 1.0521 2.5729 2.6592 6.6952 6.6774 7.1078 6.9246 11.7621 12.6555 10.7192 10.7125 1.0370 1.0370 1.0956 1.0956 1.0869 1.0869 1.1022 1.1022 1.0916 1.0915 1.0961 1.0961 1.0977 1.0976
irintensity: 0.2034 1.5929 1.2929 0.4593 6.6632 0.0969 8.8626 4.3817 0.5077 1.8961 0.0619 0.0320 0.2882 0.2277 1.0428 0.3676 1.2171 0.5878 1.1265 0.0132 2.6894 0.1053 1.7899 6.8405 3.0982 0.3276 0.4047 0.2113 11.6561 12.9996 6.0094 15.3711 1.2857 2.9728 24.9830 27.2879 1.7586 36.5807 2.5177 76.3924 3.2682 12.3578 9.8961 18.8188 2.3922 50.8457 50.5084 115.5091 3.0334 38.8868 218.6849 28.0385 0.0101 1541.7172 6.2576 3.9843 0.5994 49.6836 138.0250 0.2362 0.0492 8.3239 10.1056 6.7032 2.8929 120.6835 41.4743 646.5937 154.2404 98.9084 1.4906 108.5817 0.1835 327.8460 1.3978 19.8328 12.1654 32.7879 127.2620 2.8255 0.0643 24.4766 8.9400 28.9578 6.6664 16.7521 27.0434 77.1978 25.8451 39.6920 3.3074 57.6575 16.6322 173.6341 366.1010 117.1625 191.9474 1.4611 0.4062 9.6798 4.1924 6.4275 0.2121 0.5785 16.5723 9.5040 14.3519 16.1365 0.8762 7.6949 7.7204
temp: 298.150 k
press: 1.00000 atm
elementType: 8 8 8 8 8 8 8 6 6 6 6 6 6 6 6 6 6 6 6 6 6 6 6 6 6 1 1 1 1 1 1 1 1 1 1 1 1 1 1
symmnumber: 1
zpe: 735274.0 jmol-1
zpe.correction: 0.280051 hartree
zpe.thermalcorrener: 0.303622 hartree
zpe.thermalcorrenthalpy: 0.304566 hartree
zpe.thermalcorrgfe: 0.223575 hartree
zpe.sumelectzpe: -1219.125087 hartree
zpe.sumelectthermal: -1219.101516 hartree
zpe.sumelectthermalent: -1219.100572 hartree
zpe.sumelectthermalfe: -1219.181564 hartree
dipole: -0.0074 0.0036 -1.6270
dipole: 1.6270
quadrupole: -110.8739 -141.7640 -129.8881
quadrupole: -13.7561 -0.0360 -0.0360
quadrupole: 16.6348 -14.2554 -2.3794 -13.7561 -0.0360 -0.0360
hfenergy: -1219.4051383 hartree
pointgroup: C01 [X(C18H14O7)]
dipole: -0.0031254 0.6401095 -0.0018725 debye
polarizability: 276.4956928|-0.0342705|209.2923663|-21.1337093|-0.0298583|189.322545 unknown
InChI: InChI=1S/C18H14O7/c1-11(19)23-15-9-5-3-7-13(15)17(21)25-18(22)14-8-4-6-10-16(14)24-12(2)20/h3-10H,1-2H3
charge 0 multiplicity 1
39 atoms
O  -0.000904 0.386195 0.002646
O  4.130774 -1.04274 0.2760
O  -4.130881 -1.047456 -0.269659
O  1.346212 -1.418482 0.648859
O  -1.346779 -1.420505 -0.641401
O  3.515036 -0.131166 2.351172
O  -3.512789 -0.143368 -2.347385
C  2.332787 0.46337 -0.579349
C  -2.335469 0.46387 0.58125
C  3.705658 0.090245 -0.459722
C  -3.707882 0.088903 0.4621
C  2.012257 1.58337 -1.396328
C  -2.016639 1.587052 1.394555
C  4.710043 0.800271 -1.145386
C  -4.713512 0.800471 1.144266
C  1.252828 -0.322604 0.068708
C  -1.254699 -0.323074 -0.063973
C  3.013712 2.29699 -2.080212
C  -3.019333 2.302116 2.075103
C  4.366781 1.900479 -1.958547
C  -4.371945 1.903954 1.953729
C  3.885219 -1.113258 1.690157
C  -3.883178 -1.123227 -1.683217
C  4.155026 -2.513485 2.167312
C  -4.153829 -2.524846 -2.155777
H  0.962213 1.870968 -1.49039
H  -0.966957 1.876066 1.488259
H  5.748728 0.477803 -1.028707
H  -5.751784 0.476552 1.027957
H  2.743171 3.151862 -2.707665
H  -2.750091 3.159475 2.699713
H  5.152829 2.447438 -2.489897
H  -5.158927 2.452096 2.48247
H  3.284348 -3.135799 1.891518
H  4.276539 -2.523085 3.260181
H  5.043318 -2.936978 1.672257
H  -3.28369 -3.146818 -1.877517
H  -4.274903 -2.538094 -3.248659
H  -5.042591 -2.946061 -1.659623
