program: Gaussian 09
title: 000116168
version: EM64L-G09RevD.01
frameworkgroup: C1[X(C13H17N)]
method: RPBEPBE
basis: SDD
operation: Freq
keyword: #pfreq=noraman
keyword: PBEPBE/SDD
title: #p freq=noraman PBEPBE/SDD
converged: YES YES NO NO
title: Mulliken charges:
elementType: N C C C C C C C C C C C C C H H H H H H H H H H H H H H H H H
charge: -0.608343 -0.057568 -0.449008 -0.542097 -0.464979 0.321010 -0.381421 0.317465 -0.377301 -0.385347 -0.402224 -0.411690 0.442083 -0.810954 0.199255 0.227422 0.189989 0.228400 0.208138 0.199534 0.232721 0.208593 0.262590 0.259766 0.225369 0.236480 0.225472 0.225194 0.234218 0.223675 0.223557
chargesum: 0.00000
title: Mulliken charges with hydrogens summed into heavy atoms:
elementType: N C C C C C C C C C C C C C
charge: -0.085987 0.141686 -0.031598 -0.105559 -0.032724 0.321010 -0.172828 0.317465 -0.151932 -0.148867 -0.176751 -0.186495 0.442083 -0.129503
polarizability: 2.29783505e+02 1.09489866e+01 1.40094435e+02 1.32313085e-01 3.84556102e+00 8.47204509e+01
1716.lowfreq: -9.7411 -6.2413 -0.0008 -0.0005 -0.0002 3.5725 19.1575 44.1017 54.0212
frequency: 18.6394 43.9829 54.0176 95.8152 134.1318 205.6538 208.3763 236.1128 255.0384 296.4814 316.8559 343.3936 405.3611 419.3747 426.5444 457.1608 482.4630 525.3283 547.8013 609.4951 635.1439 638.7475 719.8623 737.0824 794.1921 807.6385 811.2820 839.9855 851.4288 917.3086 928.9120 947.2845 954.9540 960.5286 970.0155 985.8138 1011.5089 1046.4493 1058.0755 1064.7232 1081.2499 1112.9504 1128.5514 1131.9545 1190.0719 1200.6864 1225.0401 1228.6373 1240.5183 1262.8613 1299.6715 1305.3244 1312.9222 1321.7596 1350.2503 1366.5340 1379.5381 1382.7215 1396.0511 1412.0165 1454.6325 1462.0565 1469.5762 1471.2975 1472.3331 1510.8418 1570.8727 1623.0843 1638.3689 1655.7409 2853.1481 2949.7426 2950.6080 2971.0700 2978.7069 2995.4489 3016.0440 3043.8044 3051.7968 3081.4941 3106.9895 3114.6812 3116.6786 3143.5102 3149.8891 3436.3239 3562.6300
redmass: 1.0250 3.3744 3.6023 3.7051 3.3202 1.9697 2.9070 1.2281 5.1008 2.5752 2.9162 2.5777 2.8512 3.0984 1.9978 3.0391 3.9048 3.2404 2.7048 2.3109 1.8271 6.7549 2.8462 3.0682 4.2558 1.3180 1.6539 1.3608 1.6028 1.5510 2.7271 1.9972 1.6182 2.6205 1.3849 1.4078 2.7899 1.5535 1.7614 1.9867 1.8348 2.2935 1.3192 1.2410 1.3574 1.1310 1.4721 3.2128 1.4408 1.9039 1.3815 1.3704 1.2954 1.3373 2.2435 2.8757 1.7386 1.8194 1.2261 3.2130 1.0953 1.0896 1.0958 1.0945 1.0534 2.6147 5.5827 6.2820 1.1063 6.4134 1.0815 1.0599 1.0642 1.0388 1.0623 1.0997 1.0936 1.1013 1.0946 1.0997 1.0898 1.0879 1.0880 1.0942 1.0954 1.0448 1.0970
irintensity: 0.5111 0.5604 0.5770 1.5298 1.1050 0.3173 2.5454 30.2815 0.8603 7.8768 4.1832 3.4900 0.1869 3.5034 12.6113 4.2841 18.1280 17.5563 3.7971 71.1422 112.3359 1.3250 0.6834 2.6975 4.0336 53.9157 26.3091 4.7661 4.8171 3.8417 0.5815 3.3719 1.6255 1.2640 0.2426 0.4384 2.1718 19.7883 8.1267 2.6009 4.0441 25.9488 6.7374 5.0056 1.7601 1.5111 4.0292 0.1204 1.2129 4.5694 4.2121 5.4217 1.2088 0.5891 0.9563 1.6692 21.8575 2.7999 7.0208 1.8405 5.1737 11.0723 8.2827 11.3450 12.8808 40.5308 1.0763 0.0407 50.7704 11.9190 81.1406 21.2254 53.5296 48.8332 52.9097 36.6335 24.8031 50.2894 25.3390 18.7036 34.6993 6.9647 28.4860 37.7665 2.8711 3.3265 0.1235
temp: 298.150 k
press: 1.00000 atm
elementType: 7 6 6 6 6 6 6 6 6 6 6 6 6 6 1 1 1 1 1 1 1 1 1 1 1 1 1 1 1 1 1
symmnumber: 1
zpe: 699478.3 jmol-1
zpe.correction: 0.266417 hartree
zpe.thermalcorrener: 0.280052 hartree
zpe.thermalcorrenthalpy: 0.280996 hartree
zpe.thermalcorrgfe: 0.224950 hartree
zpe.sumelectzpe: -559.284231 hartree
zpe.sumelectthermal: -559.270596 hartree
zpe.sumelectthermalent: -559.269652 hartree
zpe.sumelectthermalfe: -559.325698 hartree
dipole: 0.3203 -0.4593 -1.1977
dipole: 1.3222
quadrupole: -72.5929 -77.3308 -89.1124
quadrupole: -2.0028 -6.4769 0.6620
quadrupole: 7.0858 2.3479 -9.4337 -2.0028 -6.4769 0.6620
hfenergy: -559.5506479 hartree
pointgroup: C01 [X(C13H17N1)]
dipole: -0.1219462 0.1835357 -0.4711968 debye
polarizability: 229.8515514|10.6655729|140.0576665|0.9742766|-3.484835|84.6891734 unknown
InChI: InChI=1S/C13H17N/c1-10-2-4-11(5-3-10)12-6-8-13(14)9-7-12/h2-6,13H,7-9,14H2,1H3
charge 0 multiplicity 1
31 atoms
N  -5.079712 0.017119 -0.071682
C  -3.63845 0.119132 -0.384119
C  -2.957215 1.116643 0.574435
C  -1.463076 1.290494 0.224746
C  -2.975428 -1.265936 -0.221059
C  -0.743541 -0.043288 0.014016
C  -1.462021 -1.18869 -0.196605
C  0.749082 -0.033826 0.018161
C  1.51487 -1.201821 0.300345
C  1.473047 1.162606 -0.247931
C  2.922985 -1.177844 0.28876
C  2.883964 1.183707 -0.258951
C  3.639993 0.01368 0.000885
C  5.158081 0.028593 -0.039102
H  -3.441167 0.469367 -1.429328
H  -3.073356 0.733931 1.606604
H  -3.468514 2.099703 0.531028
H  -0.958442 1.861418 1.028231
H  -1.368454 1.907517 -0.694446
H  -3.300201 -1.945693 -1.036459
H  -3.355615 -1.713475 0.722362
H  -0.929739 -2.13226 -0.378043
H  -5.57282 -0.702937 -0.611745
H  -5.573807 0.915903 -0.103362
H  1.002171 -2.133796 0.563321
H  0.930563 2.089949 -0.460693
H  3.478563 -2.095454 0.520256
H  3.406171 2.124756 -0.472808
H  5.532929 -0.2223 -1.051017
H  5.561346 1.023134 0.221824
H  5.589494 -0.709133 0.660774
