program: Gaussian 09
title: 000116088
version: EM64L-G09RevD.01
frameworkgroup: C1[X(C14H23N3O2)]
method: RPBEPBE
basis: SDD
operation: Freq
keyword: #p
keyword: freq=noraman
keyword: PBEPBE/SDD
title: #p freq=noraman PBEPBE/SDD
converged: YES YES NO NO
title: Mulliken charges:
elementType: O O N N N C C C C C C C C C C C C C C H H H H H H H H H H H H H H H H H H H H H H H
charge: -0.270066 -0.287303 -0.269941 -0.202645 -0.228532 0.040657 -0.437285 -0.437453 -0.398244 -0.398230 -0.391335 0.219575 0.192360 0.054586 0.285135 -0.614106 -0.762389 -0.634861 -0.634776 0.238963 0.250983 0.198307 0.198119 0.251191 0.198389 0.194645 0.194571 0.198387 0.195804 0.198302 0.289108 0.232857 0.232164 0.228470 0.295205 0.229199 0.219826 0.211270 0.243921 0.211228 0.219859 0.244085
chargesum: 0.00000
title: Mulliken charges with hydrogens summed into heavy atoms:
elementType: O O N N N C C C C C C C C C C C C C C
charge: -0.270066 -0.287303 -0.269941 -0.202645 -0.228532 0.279620 0.012005 0.011857 -0.005209 -0.005272 0.002771 0.219575 0.192360 0.054586 0.285135 0.140022 -0.009515 0.040157 0.040396
polarizability: 2.12542276e+02 -6.96507827e+00 1.93146812e+02 3.69026721e-02 4.38044025e-02 1.29859455e+02
1716.lowfreq: -6.1150 -0.0010 -0.0010 -0.0008 8.2349 11.4986 39.6397 48.4757 57.2817
frequency: 39.6060 48.4349 57.2292 74.2841 75.2493 90.3852 132.2654 155.0083 171.1152 176.4200 206.4794 212.7199 215.3844 217.7343 236.7981 237.5267 271.4138 284.8791 331.6931 352.4916 377.9434 395.2939 395.5753 426.5038 440.5058 448.1323 462.9169 472.1839 480.7619 498.3146 585.2033 588.5101 653.5969 702.8286 717.7375 770.1364 787.2526 788.7351 827.0614 844.7562 872.2181 899.5660 918.3452 923.1483 953.1764 982.2647 1034.0722 1035.4287 1045.2867 1049.1787 1062.5807 1064.4252 1077.3741 1080.9661 1098.0569 1109.7380 1114.9450 1121.8254 1140.7684 1165.6446 1184.3356 1193.2029 1198.4579 1224.5965 1247.6762 1259.8887 1263.4774 1286.8961 1309.0395 1328.5227 1333.0705 1336.9284 1340.3838 1345.5778 1354.5997 1370.5056 1382.3621 1404.8071 1410.9467 1431.8472 1434.9714 1445.5706 1454.5841 1461.9681 1462.3499 1464.6043 1469.2946 1470.4102 1478.9569 1479.6184 1482.7778 1488.0849 1500.7494 1504.3313 1555.8802 1608.6516 1622.0738 2936.3896 2942.9796 2965.6609 2965.9623 2973.4809 2980.3922 2994.1399 2996.6020 2998.9540 3027.9814 3028.8416 3029.8412 3030.5421 3030.7659 3040.1679 3059.7344 3069.1439 3072.8337 3077.3574 3077.4660 3087.0060 3109.6844 3129.9622
redmass: 3.4130 3.4873 2.5999 3.3807 4.2211 1.8048 1.5651 2.6931 3.5248 4.1948 1.1430 3.2576 1.0811 1.7807 3.8465 1.5260 1.9922 2.7979 1.7968 2.7237 3.3653 5.2458 4.6368 4.6053 3.8588 4.5678 4.2007 2.1658 4.6476 2.6672 4.8848 4.9000 4.0423 3.9774 11.3424 9.0182 2.5963 1.4369 3.7860 2.8241 1.8865 1.6053 2.8937 1.7348 2.5276 2.6090 2.1317 1.6512 1.8244 1.5196 1.1637 2.5097 1.2975 1.2291 3.5596 2.6302 3.9207 1.2950 1.4196 2.6787 2.6076 3.5460 1.6695 3.7942 1.3482 1.2633 1.3889 4.0025 1.3416 1.7099 1.3510 2.9526 1.4565 1.4450 1.2989 1.4740 1.3403 2.0039 1.1340 1.1876 1.5032 1.1310 1.0448 1.0879 1.0890 1.0755 1.0854 1.0867 1.0612 1.0973 1.0907 1.0501 1.0740 1.0451 8.1001 8.0361 8.4255 1.0387 1.0391 1.0624 1.0624 1.0626 1.0372 1.0629 1.0642 1.0346 1.0991 1.0904 1.0938 1.0943 1.0899 1.1035 1.0974 1.1005 1.1004 1.0988 1.1001 1.1028 1.0982 1.0992
irintensity: 0.6108 2.1750 2.4188 0.4295 0.8440 1.0880 0.4407 2.5462 2.7269 1.5113 0.0704 1.9426 0.5891 0.0698 11.3609 1.3099 0.9610 3.2513 1.2640 1.2398 0.8720 2.0453 0.2406 5.5490 0.0873 39.2913 14.2360 0.7783 0.2877 0.9934 1.1281 0.4563 28.6999 0.6864 4.8989 14.4170 3.9737 0.4883 0.9220 6.9388 5.4285 19.5306 9.5396 0.0029 12.3912 22.3806 7.1455 15.1461 0.4745 1.9350 1.4518 38.7879 0.3505 1.5845 70.1014 0.0448 14.0031 0.1124 0.7538 15.3101 11.6426 8.7112 0.2649 17.8276 14.5207 0.3143 6.3649 97.2156 0.9652 105.1089 0.4735 21.2849 0.1479 1.9267 0.5184 2.0900 5.5532 81.5974 4.9350 27.2572 133.6037 0.7743 5.8641 5.6532 6.1628 45.6216 5.6474 16.3765 15.3983 43.6982 5.9136 5.7283 36.9817 33.2651 327.8091 210.6308 211.1134 66.8647 80.6017 24.9088 47.3929 37.9013 17.0076 51.7151 14.1490 63.3783 64.3482 88.5005 52.8046 13.6740 3.4096 51.2699 9.8198 1.1530 20.0101 8.0886 79.6788 24.5278 2.6404 0.7565
temp: 298.150 k
press: 1.00000 atm
elementType: 8 8 7 7 7 6 6 6 6 6 6 6 6 6 6 6 6 6 6 1 1 1 1 1 1 1 1 1 1 1 1 1 1 1 1 1 1 1 1 1 1 1
symmnumber: 1
zpe: 940372.3 jmol-1
zpe.correction: 0.358169 hartree
zpe.thermalcorrener: 0.377961 hartree
zpe.thermalcorrenthalpy: 0.378906 hartree
zpe.thermalcorrgfe: 0.310514 hartree
zpe.sumelectzpe: -860.536356 hartree
zpe.sumelectthermal: -860.516564 hartree
zpe.sumelectthermalent: -860.515620 hartree
zpe.sumelectthermalfe: -860.584011 hartree
dipole: -3.2854 0.9760 -0.0074
dipole: 3.4273
quadrupole: -102.2028 -119.7274 -112.6757
quadrupole: -7.5898 0.0028 0.0128
quadrupole: 9.3325 -8.1921 -1.1404 -7.5898 0.0028 0.0128
hfenergy: -860.8945252 hartree
pointgroup: C01 [X(C14H23N3O2)]
dipole: -1.2985107 0.3632881 0.0102976 debye
polarizability: 212.7547332|-6.6467456|192.9233162|-0.6583745|0.6581853|129.8704931 unknown
InChI: InChI=1S/C14H23N3O2/c1-10-12(15(2)3)13(18)17(14(19)16(10)4)11-8-6-5-7-9-11/h11H,5-9H2,1-4H3
charge 0 multiplicity 1
42 atoms
O  0.200499 -1.899826 -0.013027
O  0.409636 2.803255 0.022683
N  0.334748 0.451541 0.001008
N  -1.685204 1.755675 0.027563
N  -2.677962 -1.850662 0.005912
C  1.842699 0.419617 -0.011763
C  2.421034 -0.238341 1.265462
C  2.399784 -0.225062 -1.304887
C  3.966954 -0.144337 1.245055
C  3.945848 -0.130751 -1.308325
C  4.552781 -0.778323 -0.039923
C  -0.401738 -0.779591 -0.001399
C  -0.262804 1.729222 0.017464
C  -1.868217 -0.659271 0.009526
C  -2.470714 0.591927 0.023216
C  -2.315156 3.095576 0.048035
C  -3.970005 0.750699 0.032776
C  -2.590838 -2.6542 -1.239543
C  -2.575613 -2.672176 1.2385
H  2.133313 1.485774 -0.00857
H  2.108534 -1.296158 1.310708
H  2.018029 0.274555 2.160102
H  1.982446 0.296957 -2.187618
H  2.086731 -1.282398 -1.356105
H  4.380287 -0.643648 2.14249
H  4.27516 0.920687 1.299336
H  4.252959 0.93491 -1.356087
H  4.344745 -0.620206 -2.217646
H  5.655137 -0.673226 -0.048521
H  4.330094 -1.864826 -0.043905
H  -1.504535 3.838024 0.031051
H  -2.915794 3.232156 0.963725
H  -2.960793 3.237563 -0.8352
H  -4.317762 1.304308 0.924695
H  -4.407041 -0.259279 0.036816
H  -4.328498 1.299167 -0.858313
H  -2.75464 -1.999396 -2.113409
H  -3.391354 -3.417435 -1.228073
H  -1.611091 -3.165513 -1.355359
H  -3.373941 -3.437592 1.223539
H  -2.732764 -2.030802 2.123509
H  -1.593257 -3.181996 1.336706
