program: Gaussian 09
title: 000116051
version: EM64L-G09RevD.01
frameworkgroup: C1[X(C23H27NO2)]
method: RPBEPBE
basis: SDD
operation: Freq
keyword: #p
keyword: freq=noraman
keyword: PBEPBE/SDD
title: #p freq=noraman PBEPBE/SDD
converged: YES YES NO NO
title: Mulliken charges:
elementType: O O N C C C C C C C C C C C C C C C C C C C C C C C H H H H H H H H H H H H H H H H H H H H H H H H H H H
charge: -0.258404 -0.235390 -0.096661 -0.035539 0.431598 0.365180 -0.572689 0.191420 -0.363273 -0.298585 -0.356765 -0.398765 -0.388285 -0.349031 -0.383363 -0.320266 -0.253438 -0.250489 -0.245786 -0.244982 0.263021 -0.682178 -0.693430 -0.246196 -0.243022 -0.554793 0.242408 0.254432 0.226108 0.223287 0.233766 0.235107 0.240511 0.244269 0.252675 0.273125 0.218932 0.215240 0.188030 0.226534 0.223680 0.225882 0.223173 0.229016 0.220752 0.222280 0.216072 0.211804 0.213519 0.227128 0.226329 0.229766 0.276286
chargesum: 0.00000
title: Mulliken charges with hydrogens summed into heavy atoms:
elementType: O O N C C C C C C C C C C C C C C C C C C C C C C C
charge: -0.258404 -0.235390 -0.096661 -0.035539 0.431598 0.365180 -0.075849 0.191420 0.086121 0.170289 -0.116255 -0.154496 -0.135609 -0.075906 0.050810 0.094298 -0.029758 -0.024607 -0.022614 -0.015966 0.263021 -0.023075 -0.040979 -0.019867 -0.013257 -0.278507
polarizability: 2.78299513e+02 2.95277564e+01 2.67827488e+02 1.07302921e+01 -9.64787301e+00 2.15068773e+02
1716.lowfreq: -4.7984 0.0004 0.0007 0.0007 5.8649 10.8746 15.4774 19.4394 20.9114
frequency: 14.4748 19.3867 20.8575 29.5688 44.6474 47.2826 54.2049 67.3195 70.2762 79.3982 101.9761 105.8493 121.7570 140.7887 167.5513 194.3852 207.6921 222.7296 232.5476 253.5540 271.9071 275.7424 276.6827 291.6778 297.1872 315.2029 337.5686 358.7816 377.3896 397.8729 400.8802 404.7030 404.9415 488.3323 490.0793 498.4582 528.3661 587.3412 611.4578 616.7589 621.0416 628.1573 646.3041 652.3476 694.8887 701.9126 706.0990 725.5448 744.2615 761.1420 770.8431 772.5917 795.2666 801.9904 829.9464 849.2625 854.8759 887.9398 894.3324 910.0114 924.7582 926.4648 971.3119 973.0486 976.1698 981.5337 991.1110 991.5699 993.4328 995.8129 1000.8337 1030.9807 1032.8473 1037.8080 1050.0458 1059.4123 1066.4705 1075.7653 1087.0006 1090.3674 1098.9547 1115.2184 1138.6686 1173.0133 1174.1044 1175.1147 1181.8466 1184.9998 1201.4063 1202.8845 1205.3666 1248.4099 1271.1879 1278.1054 1299.4273 1306.6355 1321.2548 1327.4711 1329.9125 1334.4947 1340.1857 1371.9836 1374.8294 1376.3730 1380.3254 1382.1361 1387.1978 1433.4996 1435.9779 1446.3033 1449.5600 1457.2574 1467.7910 1471.8345 1476.3640 1481.0790 1484.4010 1485.2800 1487.2208 1497.9136 1588.8720 1591.8882 1607.4627 1611.7181 1619.2340 2144.4329 2873.4525 2918.5988 2977.3553 2982.4228 2990.5491 2993.9425 3026.7060 3038.1638 3041.2088 3046.5730 3058.8403 3072.6536 3076.0885 3081.0541 3088.9989 3120.3213 3124.7580 3128.9483 3129.6786 3133.0701 3141.7724 3145.9971 3157.0316 3157.6579 3167.9487 3175.4118 3427.1713
redmass: 3.7486 4.8212 3.7700 3.8517 3.7286 3.8375 2.9232 4.3327 4.1164 4.1630 3.8272 3.7156 3.4692 5.5450 1.5622 3.3085 3.9930 1.1432 4.3579 4.2423 3.7519 1.7732 2.1867 4.2468 3.9092 4.0380 5.5516 2.8639 3.8401 2.4990 2.8874 2.9061 3.6852 3.0942 3.1101 3.6497 3.3082 6.2654 5.1705 6.2316 4.9567 1.2435 1.7638 2.3552 5.7641 1.7101 1.7494 2.7350 2.9526 1.9970 1.1724 1.8770 1.4803 1.3511 2.4382 1.2528 1.2495 5.0710 2.2715 2.7911 1.5717 1.5624 4.1709 2.4697 1.4229 1.4140 5.0495 4.1374 1.5118 1.9625 1.8944 2.5443 2.2871 2.5024 3.1690 2.5479 1.9852 2.1136 2.2073 1.6464 1.9650 1.6646 3.9959 1.4197 1.8062 1.0676 1.7380 2.1276 1.1267 1.1534 2.0701 1.4480 1.5766 1.1374 1.2020 1.3764 1.2911 1.3660 1.3180 1.3387 1.2277 1.3269 1.2587 6.7047 6.8510 1.2810 1.2838 2.2205 2.1882 1.0948 1.1218 1.0652 1.0502 1.0596 1.0565 1.0494 2.1246 2.1171 1.0710 1.0790 5.8883 6.0896 6.2510 6.1798 9.0341 6.0499 1.0713 1.0687 1.0351 1.0371 1.0602 1.0596 1.0874 1.0963 1.0714 1.0841 1.0994 1.0991 1.0988 1.1009 1.1005 1.0847 1.0847 1.0882 1.1081 1.0883 1.0937 1.0933 1.0954 1.0985 1.0998 1.0962 1.1588
irintensity: 0.1006 0.3352 0.1922 0.0529 0.3718 0.0474 0.2875 0.1729 0.4672 0.3882 0.2459 0.3978 0.7154 1.4894 1.8054 0.0602 0.2788 0.0852 1.0463 0.6872 0.9030 0.6754 1.4651 1.8551 12.9458 5.8818 3.4210 7.4920 1.4770 0.7833 1.9566 0.5092 8.7180 3.2128 13.9219 0.7020 10.6875 6.5655 12.4572 0.0583 7.8258 70.7479 49.8425 51.2917 2.2416 41.6528 77.5599 4.4137 4.4622 24.6462 0.8349 27.7603 2.6396 13.0977 7.8489 0.5393 0.7671 8.3476 6.4088 13.6159 15.0808 0.8527 1.1751 8.8866 0.3801 0.6173 4.9304 2.5629 0.3048 85.1654 71.2684 9.4849 4.7984 37.8176 17.2059 3.2592 30.3960 32.1636 43.4343 3.3628 57.2764 4.8601 269.3675 0.9409 1.2902 0.2233 6.8215 2.4718 1.1856 2.5755 29.4262 20.9705 17.0471 5.6215 12.0542 12.8981 5.3214 1.7548 0.1127 3.5761 12.3029 11.8824 16.5711 0.0854 0.6793 10.2937 20.9127 17.8217 4.5984 5.8628 14.8956 13.1445 14.8874 4.4779 2.3538 6.8496 32.6100 13.1475 15.1052 3.6484 1.1697 1.4028 28.9779 6.9458 93.1351 6.0036 72.7200 64.2730 26.7155 25.8923 49.7073 14.7978 10.2474 18.1799 14.9117 25.1219 7.5988 42.0742 73.5727 45.2178 42.1426 1.3818 0.8826 3.7485 13.0352 5.7452 30.0643 19.8500 31.6685 39.2885 16.5113 6.6263 61.1221
temp: 298.150 k
press: 1.00000 atm
elementType: 8 8 7 6 6 6 6 6 6 6 6 6 6 6 6 6 6 6 6 6 6 6 6 6 6 6 1 1 1 1 1 1 1 1 1 1 1 1 1 1 1 1 1 1 1 1 1 1 1 1 1 1 1
symmnumber: 1
zpe: 1152177.6 jmol-1
zpe.correction: 0.438841 hartree
zpe.thermalcorrener: 0.465524 hartree
zpe.thermalcorrenthalpy: 0.466468 hartree
zpe.thermalcorrgfe: 0.378329 hartree
zpe.sumelectzpe: -1095.843509 hartree
zpe.sumelectthermal: -1095.816826 hartree
zpe.sumelectthermalent: -1095.815882 hartree
zpe.sumelectthermalfe: -1095.904021 hartree
dipole: 0.6394 -0.3843 1.0586
dipole: 1.2950
quadrupole: -138.0146 -146.4588 -153.6185
quadrupole: 8.7072 0.6316 -2.5512
quadrupole: 8.0160 -0.4282 -7.5878 8.7072 0.6316 -2.5512
hfenergy: -1096.28235 hartree
pointgroup: C01 [X(C23H27N1O2)]
dipole: -0.2761207 0.1784843 0.3892223 debye
polarizability: 272.6791697|28.1041327|275.3817732|-14.1407261|0.9658508|213.1348305 unknown
InChI: InChI=1S/C23H27NO2/c1-4-17-23(20-13-9-7-10-14-20,21-15-11-8-12-16-21)22(25)26-19-18-24(5-2)6-3/h1,7-16H,5-6,17-19H2,2-3H3
charge 0 multiplicity 1
53 atoms
O  -1.065389 0.974202 0.755807
O  -0.509318 -0.060478 -1.249574
N  -4.648597 0.138736 -0.122017
C  1.230094 0.221831 0.527231
C  2.040124 -0.972591 -0.030479
C  1.894812 1.576174 0.141069
C  1.12139 0.066055 2.088996
C  -0.187596 0.313703 -0.098544
C  -3.334457 -0.043248 0.533718
C  -2.453894 1.189419 0.243856
C  1.423146 -2.180271 -0.44163
C  2.284927 2.549195 1.092606
C  3.457386 -0.907244 -0.016375
C  2.11224 1.846919 -1.236726
C  -5.814526 -0.274155 0.696367
C  -4.657997 -0.318322 -1.536724
C  2.204406 -3.28694 -0.841616
C  2.882773 3.762851 0.678521
C  4.2396 -2.014527 -0.409201
C  2.702053 3.058414 -1.650398
C  0.42961 -1.155287 2.528799
C  -5.96095 -1.798198 0.961714
C  -5.802909 0.292343 -2.365825
C  3.615129 -3.211676 -0.827423
C  3.092824 4.024287 -0.692706
C  -0.157264 -2.160081 2.935168
H  2.149501 0.070025 2.499551
H  0.58193 0.936934 2.501211
H  -2.801441 -0.959022 0.190246
H  -3.472359 -0.140323 1.625707
H  -2.4059 1.392965 -0.839403
H  -2.814341 2.076374 0.785334
H  0.333311 -2.258793 -0.465735
H  2.13316 2.381135 2.162743
H  3.954187 0.019256 0.293556
H  1.814657 1.099938 -1.98121
H  -6.7310 0.101241 0.204669
H  -5.745105 0.257952 1.664522
H  -4.695645 -1.433453 -1.612047
H  -3.693246 -0.017388 -1.985804
H  1.708027 -4.209316 -1.163833
H  3.181802 4.501968 1.430371
H  5.332906 -1.940606 -0.392382
H  2.858172 3.248433 -2.718142
H  -6.102374 -2.36489 0.023559
H  -5.068691 -2.202585 1.474696
H  -6.838838 -1.990333 1.606543
H  -6.795631 -0.054324 -2.026092
H  -5.697383 0.004748 -3.428112
H  -5.77969 1.394204 -2.295157
H  4.218937 -4.071665 -1.138647
H  3.553609 4.965692 -1.012048
H  -0.650773 -3.04878 3.282788
