program: Gaussian 09
title: 000015085
version: EM64L-G09RevD.01
frameworkgroup: C1[X(C22H38)]
method: RPBEPBE
basis: SDD
operation: Freq
keyword: #p
keyword: freq=noraman
keyword: PBEPBE/SDD
title: #p freq=noraman PBEPBE/SDD
converged: YES YES NO NO
title: Mulliken charges:
elementType: C C C C C C C C C C C C C C C C C C C C C C H H H H H H H H H H H H H H H H H H H H H H H H H H H H H H H H H H H H H H
charge: -0.386792 -0.411569 -0.389461 -0.386570 -0.402167 -0.393810 -0.385425 -0.381356 -0.384061 -0.367743 -0.361840 -0.379215 -0.345588 -0.578765 -0.354650 0.497118 -0.702814 -0.402857 -0.418580 -0.239315 -0.238736 -0.224588 0.214945 0.189073 0.190587 0.191391 0.209228 0.189518 0.213190 0.186107 0.190215 0.192337 0.198994 0.195542 0.198419 0.189270 0.182762 0.192513 0.198816 0.188698 0.209629 0.198417 0.182195 0.187339 0.203154 0.198486 0.197523 0.179911 0.210376 0.203372 0.191960 0.194464 0.223010 0.211751 0.203178 0.230799 0.231352 0.224540 0.222897 0.222820
chargesum: 0.00000
title: Mulliken charges with hydrogens summed into heavy atoms:
elementType: C C C C C C C C C C C C C C C C C C C C C C
charge: 0.017227 -0.029590 0.009285 0.012728 -0.019616 0.000726 0.002264 -0.006081 0.003453 0.040304 0.007695 0.022426 0.031846 -0.165017 0.031775 0.497118 -0.064875 -0.172058 -0.187228 -0.014775 -0.015839 -0.001767
polarizability: 2.42415684e+02 1.94665882e+01 2.46963549e+02 -1.79957560e+01 1.16054460e+01 1.99619091e+02
1716.lowfreq: -25.6125 -10.7864 -4.0488 -0.0006 -0.0003 -0.0002 5.1713 9.7346 17.3660
frequency: -24.6783 5.1099 16.6836 19.4118 28.4926 28.8361 41.7599 52.8479 68.6780 76.6861 89.3092 107.9190 109.3505 127.2688 156.5648 172.4025 178.4030 185.6513 203.0474 211.6556 232.3835 247.7731 258.4802 268.6909 300.0751 337.1431 344.6852 385.7219 401.8981 407.9315 414.5120 466.6272 487.8859 503.8403 527.8793 564.3801 617.3380 702.9673 703.2434 716.4384 722.8320 731.7931 749.3022 752.6516 765.3970 786.4590 800.3669 808.5621 826.1323 851.6641 855.3919 863.3897 882.6268 894.8478 900.7179 916.4772 932.1032 947.7389 971.5621 973.7068 980.8842 989.8134 990.5862 1000.2322 1011.1683 1019.8435 1026.2146 1041.7020 1055.1458 1058.2563 1062.6733 1076.3996 1080.0798 1082.1742 1094.2098 1103.7772 1111.1134 1121.6728 1122.3306 1137.7275 1162.6969 1170.5485 1172.4728 1186.3454 1189.0863 1203.6300 1216.1672 1226.9795 1237.6480 1246.3746 1255.7620 1269.8079 1272.7078 1281.5130 1283.3150 1284.9406 1288.8611 1292.1281 1295.2048 1296.6497 1308.1143 1312.6194 1320.0170 1329.5206 1333.5344 1338.8856 1343.4214 1347.2413 1354.0902 1356.0908 1358.2707 1361.7314 1363.2133 1381.9408 1387.4901 1438.7552 1458.1884 1459.3053 1460.6396 1461.4114 1462.8621 1463.5875 1465.8971 1467.9670 1471.2396 1471.6744 1474.7938 1475.4248 1476.0897 1481.7597 1483.9747 1484.0894 1485.3732 1487.9755 1591.8807 1613.3065 2947.4964 2947.6653 2949.8717 2950.8218 2952.1989 2955.2878 2956.9159 2959.2877 2961.9517 2964.4694 2966.3514 2968.6422 2968.7205 2971.2657 2973.2439 2976.6586 2982.4100 2992.6474 2994.4552 2998.5011 3000.6254 3003.6822 3007.5952 3011.5279 3017.7926 3025.2628 3031.1221 3035.3783 3036.5086 3040.2266 3042.6700 3063.9412 3068.8035 3111.4825 3114.3743 3129.8175 3140.4263 3159.9126
redmass: 1.5489 4.4764 4.2061 3.5637 4.3046 3.5174 3.8361 3.1318 2.7796 3.2148 2.9037 1.7636 2.2128 2.2742 2.6144 2.0934 2.6689 2.7689 2.4545 2.4935 1.1234 3.1648 2.5279 2.3008 1.8621 2.5807 2.1864 2.5291 2.8245 2.9713 2.5821 2.7183 3.3762 2.5783 2.3029 2.7680 6.3260 1.4298 1.4458 1.0897 1.1930 1.2041 1.3508 2.2544 1.4618 1.3754 1.6443 1.6686 1.7366 1.3976 1.6540 1.7330 1.6897 1.9093 1.6145 1.4778 2.1652 1.6894 1.7737 1.3888 1.5859 5.6551 1.3300 2.7869 2.0056 1.8058 2.2051 1.7226 1.6498 2.4008 2.1009 2.0982 2.4090 1.5930 1.7944 2.1192 1.5015 2.2627 1.6757 2.0628 1.4248 1.1633 1.3214 1.1189 1.6397 1.7088 1.8030 1.3824 1.3338 1.3357 1.3186 1.2772 1.2505 1.1461 1.2550 1.1036 1.1609 1.1496 1.1469 1.1573 1.1766 1.3856 1.2172 1.2753 1.3905 1.3979 1.4133 1.4891 1.6493 1.5597 1.5156 1.4853 1.4886 7.3798 1.2207 2.1611 1.0741 1.0851 1.0722 1.0745 1.0784 1.0833 1.0877 1.0778 1.1186 1.0780 1.0948 1.0466 1.0759 1.2778 1.7261 1.0851 1.0952 1.0889 6.0313 6.1549 1.0590 1.0588 1.0594 1.0602 1.0598 1.0596 1.0609 1.0591 1.0605 1.0608 1.0611 1.0604 1.0366 1.0621 1.0621 1.0615 1.0958 1.0987 1.0962 1.0982 1.0980 1.1010 1.1015 1.1011 1.0988 1.1032 1.1024 1.1027 1.1027 1.1023 1.1037 1.1001 1.0998 1.0866 1.0867 1.0909 1.0959 1.1014
irintensity: 0.0224 0.0019 0.0021 0.0064 0.0130 0.0251 0.0006 0.0282 0.0174 0.0147 0.0752 0.0057 0.1857 0.0033 1.3653 0.0964 0.0034 0.0106 0.0126 0.0149 0.0581 0.3124 0.0891 0.0798 0.6976 0.4361 0.0559 0.2940 0.0276 1.0818 0.3303 0.2909 4.6115 3.0547 0.5115 10.6753 0.1367 23.6652 36.5010 18.8258 8.7814 6.5794 34.8495 19.0811 12.6162 1.8216 1.4082 0.3063 5.3869 0.8889 1.2158 0.9097 4.1484 2.3749 0.7543 2.0950 0.6916 5.9490 1.0331 0.0131 1.1852 0.0291 0.3091 2.5315 5.6249 0.2403 7.6018 0.3585 2.1966 0.0281 0.6439 1.1885 2.4626 6.3024 6.0581 0.5307 5.8989 0.2289 0.5144 0.7894 0.6928 0.4828 0.7695 0.6043 0.0847 0.4814 0.0226 3.7788 2.2719 2.5314 3.5969 2.4202 2.1768 2.1602 1.2445 0.9906 1.7747 0.7748 0.8784 2.1156 0.2032 2.5703 0.1400 0.7516 0.1374 2.1887 2.6620 1.2209 0.4047 5.2924 0.8081 0.3830 3.2154 0.3587 8.3057 6.6861 2.8883 2.9513 2.2678 1.2201 6.1633 5.3209 4.1422 0.5119 10.4255 1.0833 16.4955 9.1367 4.7642 6.7971 20.6783 2.7676 4.5055 31.7266 0.8783 8.2845 1.8696 23.1820 3.4869 29.4095 19.5971 3.9871 14.9517 10.8931 16.8392 16.9280 242.8099 95.3786 35.6705 10.6829 31.6030 39.7855 4.3741 1.1028 18.6791 7.1569 14.6594 1.2353 10.0546 7.0100 37.2765 13.1653 30.8688 36.7032 275.2793 106.9519 162.1525 79.6504 79.4848 8.8774 6.9395 11.6728 44.5934 21.3726
temp: 298.150 k
press: 1.00000 atm
elementType: 6 6 6 6 6 6 6 6 6 6 6 6 6 6 6 6 6 6 6 6 6 6 1 1 1 1 1 1 1 1 1 1 1 1 1 1 1 1 1 1 1 1 1 1 1 1 1 1 1 1 1 1 1 1 1 1 1 1 1 1
symmnumber: 1
zpe: 1432019.3 jmol-1
zpe.correction: 0.545427 hartree
zpe.thermalcorrener: 0.570815 hartree
zpe.thermalcorrenthalpy: 0.571759 hartree
zpe.thermalcorrgfe: 0.484340 hartree
zpe.sumelectzpe: -859.377743 hartree
zpe.sumelectthermal: -859.352355 hartree
zpe.sumelectthermalent: -859.351411 hartree
zpe.sumelectthermalfe: -859.438831 hartree
dipole: -0.2799 -0.4142 -0.1836
dipole: 0.5326
quadrupole: -143.3104 -136.1413 -138.5699
quadrupole: 1.4391 -4.0959 2.4286
quadrupole: -3.9699 3.1993 0.7706 1.4391 -4.0959 2.4286
hfenergy: -859.9231701 hartree
pointgroup: C01 [X(C22H38)]
dipole: 0.1270085 -0.1509736 0.0705541 debye
polarizability: 245.0463124|-20.1782467|242.9420788|-17.9071504|-13.2269784|201.0099331 unknown
InChI: InChI=1S/C22H38/c1-2-3-4-5-6-7-8-9-10-11-12-13-14-16-19-22-20-17-15-18-21-22/h15,17-18,20-21H,2-14,16,19H2,1H3
charge 0 multiplicity 1
60 atoms
C  4.532771 0.082252 -0.007999
C  4.627063 -1.461808 0.089497
C  3.827042 0.592167 -1.286703
C  3.266144 -2.197999 0.194359
C  3.810475 2.137399 -1.415356
C  2.428755 -1.784255 1.428373
C  2.956145 2.878988 -0.354696
C  1.210432 -2.699736 1.699706
C  1.438942 2.592864 -0.449865
C  0.145783 -2.693913 0.577228
C  0.603747 3.40361 0.567282
C  -1.097106 -3.536462 0.93686
C  -0.918044 3.166896 0.439235
C  -2.182991 -3.570039 -0.17898
C  -1.747771 3.944931 1.486277
C  -2.827115 -2.213741 -0.434558
C  -3.268724 3.72448 1.336234
C  -3.787582 -1.692335 0.472525
C  -2.472332 -1.426736 -1.560397
C  -4.372459 -0.423457 0.26488
C  -3.053999 -0.155269 -1.773625
C  -4.00631 0.352082 -0.860622
H  4.016958 0.475156 0.889655
H  5.558899 0.505009 0.019227
H  5.177443 -1.843513 -0.795715
H  5.238841 -1.726249 0.977311
H  2.789253 0.20731 -1.325926
H  4.346774 0.164523 -2.169367
H  2.680524 -2.03341 -0.731015
H  3.458816 -3.290171 0.246726
H  4.855702 2.507048 -1.360187
H  3.433989 2.412119 -2.422782
H  2.074026 -0.739769 1.309496
H  3.089036 -1.78959 2.320945
H  3.31456 2.627736 0.664315
H  3.115627 3.970954 -0.472666
H  1.56491 -3.74005 1.861162
H  0.726265 -2.384951 2.647723
H  1.242898 1.512184 -0.293653
H  1.090987 2.825474 -1.478647
H  -0.162484 -1.649186 0.369153
H  0.586283 -3.085162 -0.362399
H  0.818673 4.485416 0.437018
H  0.930381 3.145473 1.596881
H  -1.548749 -3.143409 1.870741
H  -0.780717 -4.577572 1.154185
H  -1.135323 2.082478 0.533715
H  -1.249479 3.458846 -0.579775
H  -2.962686 -4.300892 0.113663
H  -1.722457 -3.949591 -1.112163
H  -1.519158 5.027505 1.402688
H  -1.427443 3.637986 2.503115
H  -3.521424 2.651296 1.429037
H  -3.837736 4.278015 2.106143
H  -3.621093 4.066331 0.344058
H  -4.082835 -2.290204 1.344546
H  -1.736318 -1.814469 -2.27593
H  -5.116414 -0.041875 0.974005
H  -2.766089 0.436528 -2.650288
H  -4.458903 1.336757 -1.023551
