program: Gaussian 09
title: 000015061
version: EM64L-G09RevD.01
frameworkgroup: C1[X(C8H10N4O2)]
method: RPBEPBE
basis: SDD
operation: Freq
keyword: #p
keyword: freq=noraman
keyword: PBEPBE/SDD
title: #p freq=noraman PBEPBE/SDD
converged: YES YES NO NO
title: Mulliken charges:
elementType: O O N N N N C C C C C C C C H H H H H H H H H H
charge: -0.224756 -0.224749 0.065469 0.065464 0.007258 0.007258 -0.358952 -0.358985 -0.506931 -0.506937 0.196223 0.196214 -0.359512 -0.359501 0.216153 0.214127 0.216105 0.214193 0.240784 0.239834 0.239912 0.240720 0.270300 0.270306
chargesum: 0.00000
title: Mulliken charges with hydrogens summed into heavy atoms:
elementType: O O N N N N C C C C C C C C
charge: -0.224756 -0.224749 0.065469 0.065464 0.007258 0.007258 0.071329 0.071313 -0.026313 -0.026305 0.196223 0.196214 -0.089212 -0.089195
polarizability: 2.32523725e+02 8.04628319e+00 1.05265031e+02 -4.08229846e-01 -1.27409908e-02 6.52791357e+01
1716.lowfreq: -1.9241 -0.0011 -0.0010 -0.0009 3.8762 8.2863 12.2618 22.5257 23.0798
frequency: 12.2616 21.1213 23.0779 40.0430 69.8860 92.9745 104.8518 129.5863 135.6198 139.0172 183.1718 190.5855 303.1369 371.5890 412.7522 449.9035 463.8746 495.0967 495.9104 548.0680 548.4778 616.5483 618.9493 700.8167 716.4826 722.5206 788.2601 898.7686 908.7028 910.4369 1008.7005 1015.7079 1068.3158 1074.7465 1089.9381 1116.0910 1118.1977 1172.5943 1173.3238 1231.3796 1232.4444 1283.4459 1286.1145 1286.7639 1332.4377 1356.1702 1365.9972 1368.0523 1436.1518 1439.2443 1462.7832 1478.1735 1585.1869 1586.0658 2049.7598 2051.7684 2963.3330 2963.9356 2989.0530 2998.3492 3008.5379 3009.9160 3038.8641 3066.5626 3191.5439 3191.5799
redmass: 7.3005 2.5254 6.4492 7.6117 3.1535 9.6841 3.3541 2.2838 9.7155 3.2458 9.9636 8.0244 5.3697 5.7320 7.2127 8.5981 4.7036 3.8918 4.2638 1.9684 1.9464 1.7427 1.7864 5.9726 4.7443 1.1636 1.4880 1.5718 5.8377 5.5759 5.9630 4.2001 1.7702 2.7485 2.3084 3.4305 1.2011 1.8645 1.8085 1.3183 1.3840 1.0724 1.1448 1.4647 1.7554 2.0176 2.4241 2.2329 1.0929 1.1001 1.0749 1.0946 7.8104 7.6816 13.0642 13.0878 1.0596 1.0601 1.0607 1.0595 1.0976 1.0986 1.1023 1.1037 1.0902 1.0902
irintensity: 18.0287 0.0003 3.8522 4.5815 0.0000 0.0000 0.5430 0.9156 4.7114 0.0000 0.0000 0.0000 14.1392 7.3735 0.0000 28.9522 0.0000 0.0010 9.3015 0.0004 21.6854 0.0003 88.7379 0.0000 18.4346 27.1845 0.0000 12.2296 35.9695 0.0002 86.2292 0.0001 0.0007 0.0000 123.4148 0.0001 0.2805 29.2986 0.0052 0.0188 24.3479 0.0001 0.2561 0.0008 196.5372 0.0000 518.5959 0.0028 36.2489 0.0001 0.0000 21.7804 311.2956 0.0177 891.5401 0.0303 30.6117 0.0098 0.0002 40.3520 0.0003 11.1820 0.0001 72.7443 2.3439 2.9866
temp: 298.150 k
press: 1.00000 atm
elementType: 8 8 7 7 7 7 6 6 6 6 6 6 6 6 1 1 1 1 1 1 1 1 1 1
symmnumber: 1
zpe: 461780.8 jmol-1
zpe.correction: 0.175883 hartree
zpe.thermalcorrener: 0.191355 hartree
zpe.thermalcorrenthalpy: 0.192299 hartree
zpe.thermalcorrgfe: 0.128245 hartree
zpe.sumelectzpe: -679.163591 hartree
zpe.sumelectthermal: -679.148119 hartree
zpe.sumelectthermalent: -679.147175 hartree
zpe.sumelectthermalfe: -679.211229 hartree
dipole: -0.0003 0.0001 0.0090
dipole: 0.0090
quadrupole: -99.4515 -83.6944 -80.4105
quadrupole: -31.2554 -0.0406 -0.0190
quadrupole: -11.5994 4.1577 7.4417 -31.2554 -0.0406 -0.0190
hfenergy: -679.3394745 hartree
pointgroup: C01 [X(C8H10N4O2)]
dipole: 0.000113 0.0035369 0.0000737 debye
dipolederiv: -0.5570971 -0.0007348 0.0987962 0.0012933 -0.3062974 0.0043618 -0.5457192 0.0029546 -0.8764848 -0.5570976 -0.000931 0.0988143 0.0030493 -0.3063038 0.0057439 -0.5457025 0.0042522 -0.8765261 1.6669309 0.004353 -0.2252506 0.0092294 0.1708287 0.0008857 -1.3188316 -0.0010002 -0.0510755 1.6672464 0.0051649 -0.225064 0.0132967 0.1708397 0.0014246 -1.3184204 -0.0004664 -0.0511715 -1.0933747 -0.001806 -0.000994 -0.0058442 -0.0701448 -0.0003013 0.7488677 0.0009108 -0.0164552 -1.0935738 -0.0019252 -0.0010703 -0.0081872 -0.070148 -0.000438 0.7485245 0.0008281 -0.0164295 0.0125709 0.0002998 0.0002855 0.0039395 0.1597113 0.0011753 -0.0094759 0.0022396 0.0604393 0.0125373 0.0003107 0.0002681 0.0034845 0.1597027 0.0014504 -0.0096156 0.0024574 0.0604625 -0.3270107 -0.0024081 0.1249435 -0.0158681 0.1653101 0.0084964 0.3010023 0.0063073 -0.0744125 -0.3270868 -0.0024883 0.1249137 -0.0148658 0.1653197 0.0081053 0.3011119 0.0062164 -0.0744464 1.6765609 0.0054621 0.0574174 0.0055465 0.1677361 -0.0072453 0.9377704 -0.0044531 0.958982 1.6766432 0.0047277 0.0574913 0.0017502 0.1677378 -0.0088543 0.9377972 -0.0061083 0.9590949 -1.6423912 -0.0022544 -0.0527497 -0.0031276 -0.3464296 -0.0017212 0.0047833 -0.0019828 -0.0637507 -1.6425035 -0.0020998 -0.0529462 -0.0031099 -0.3464267 -0.0025399 0.0046509 -0.002796 -0.0637593 0.0612038 -0.0048907 -0.0053397 0.0110852 -0.0571748 -0.1031233 -0.0112518 -0.1012812 -0.0158408 0.0564499 0.0046485 -0.0049234 -0.0109576 -0.0731306 0.1013736 -0.0111236 0.099233 -0.0039657 0.0608778 -0.0048381 -0.0052909 0.0111834 -0.0573204 -0.1031925 -0.0111525 -0.1013562 -0.0158478 0.0567645 0.0046895 -0.0049477 -0.0108889 -0.0729769 0.1013032 -0.0111801 0.0991627 -0.0039645 0.0093269 0.0099524 0.0044227 0.0220121 -0.0380334 0.1090615 -0.0522793 0.0907429 0.0231628 0.0089779 -0.0123626 0.001012 -0.0175288 -0.0260302 -0.1136546 -0.0557106 -0.0947266 0.0095482 0.009005 -0.0122283 0.0011899 -0.017667 -0.0260964 -0.113508 -0.0556035 -0.094612 0.0097524 0.0093246 0.0100737 0.0042752 0.0218638 -0.037967 0.1092209 -0.0524072 0.0908735 0.0229815 0.1278573 -0.0003441 0.0023676 0.0001899 0.2536521 0.0006508 0.0119808 0.0009927 0.049846 0.1278581 -0.0003711 0.0023794 0.0001214 0.2536419 0.001325 0.0119848 0.0016115 0.0498606 unknown
polarizability: 232.3408568|0.2732566|65.2825259|-9.3829907|-0.4105862|105.4445087 unknown
InChI: InChI=1S/C8H10N4O2/c9-11-5-7(13)3-1-2-4-8(14)6-12-10/h5-6H,1-4H2
charge 0 multiplicity 1
24 atoms
O  3.327508 -0.006057 -1.410082
O  -3.338161 -0.007841 1.397158
N  5.613067 -0.01097 0.249068
N  -5.623639 0.001152 -0.262178
N  6.643153 -0.005736 -0.322595
N  -6.653881 -0.005858 0.309189
C  0.667073 0.007117 -0.38496
C  -0.677676 -0.016294 0.372293
C  1.868298 -0.02683 0.577638
C  -1.878832 0.016858 -0.590422
C  3.221419 -0.014429 -0.147913
C  -3.231989 0.003678 0.135023
C  4.388252 -0.015922 0.758282
C  -4.398763 0.007838 -0.771252
H  0.734561 -0.852956 -1.078304
H  0.736221 0.912096 -1.018734
H  -0.745437 0.844003 1.06533
H  -0.746619 -0.921065 1.006376
H  1.823458 -0.932047 1.218676
H  1.832159 0.837365 1.272986
H  -1.842159 -0.847782 -1.285223
H  -1.834359 0.921669 -1.232018
H  4.29499 -0.021054 1.845113
H  -4.305342 0.016365 -1.858052
