program: Gaussian 09
title: 000115599
version: EM64L-G09RevD.01
frameworkgroup: C1[X(C21H30N2O2)]
method: RPBEPBE
basis: SDD
operation: Freq
keyword: #p
keyword: freq=noraman
keyword: PBEPBE/SDD
title: #p freq=noraman PBEPBE/SDD
converged: YES YES NO NO
title: Mulliken charges:
elementType: O O N N C C C C C C C C C C C C C C C C C C C C C H H H H H H H H H H H H H H H H H H H H H H H H H H H H H H
charge: -0.277186 -0.239771 -0.068023 -0.090579 -0.166276 -0.176064 -0.458721 -0.461105 -0.402060 -0.384753 -0.342725 -0.645117 -0.243431 -0.200204 -0.465414 -0.464996 -0.448026 -0.288481 0.214683 0.403876 -0.401303 -0.387690 -0.249249 -0.243570 -0.245184 0.231594 0.233085 0.220504 0.225304 0.224792 0.222267 0.201841 0.208922 0.204949 0.203368 0.190724 0.220417 0.198293 0.226225 0.226022 0.273440 0.264078 0.219574 0.230206 0.218708 0.212684 0.222528 0.221160 0.239495 0.233739 0.254047 0.230525 0.222778 0.223043 0.227058
chargesum: 0.00000
title: Mulliken charges with hydrogens summed into heavy atoms:
elementType: O O N N C C C C C C C C C C C C C C C C C C C C C
charge: -0.277186 -0.239771 -0.068023 -0.090579 0.065318 0.057021 -0.012912 -0.014046 0.008703 0.023565 0.068416 0.005422 0.030008 0.063874 -0.015634 -0.033604 -0.004338 0.184753 0.214683 0.403876 -0.147256 -0.157165 -0.026472 -0.020528 -0.018126
polarizability: 2.90142079e+02 4.37769174e+00 2.45808793e+02 1.05391373e+01 5.80654136e+00 1.77040924e+02
1716.lowfreq: -15.8279 -7.3892 -2.8491 -0.0007 -0.0006 0.0006 4.0420 11.0568 20.5627
frequency: -14.6649 10.4504 19.5119 29.4077 32.7902 38.9479 71.7022 100.0217 105.5975 122.3142 142.2119 156.4776 167.1283 190.7328 197.2544 211.6906 226.0160 230.9457 265.1091 289.3867 312.6611 325.2109 337.2918 354.5244 374.4163 398.2454 404.2775 423.5846 428.0956 485.7080 511.1878 521.9605 591.9168 607.7423 617.0360 630.5745 678.1905 706.7899 708.3144 712.0118 748.3616 748.7912 761.1067 783.8776 791.3936 806.2939 821.7243 826.1583 837.0325 854.9508 857.9387 890.4756 909.8329 911.9590 912.6194 921.7307 933.9360 945.1864 965.8582 978.4755 982.4415 987.3576 989.8377 994.6107 999.7000 1025.7497 1032.2977 1045.1259 1050.3889 1060.8429 1061.4618 1071.3280 1087.0219 1092.6319 1104.4850 1108.8992 1109.6426 1125.3162 1132.4633 1138.0943 1148.0177 1153.8731 1159.1237 1173.4937 1174.3606 1196.5274 1200.9710 1210.8047 1214.4730 1224.0073 1230.3880 1231.6224 1239.1510 1253.6045 1265.9224 1273.5870 1275.9285 1281.9154 1291.7931 1299.6356 1300.3575 1308.2835 1313.5724 1319.8028 1323.4399 1332.7759 1337.1867 1342.0473 1349.5064 1368.4700 1375.5710 1395.7109 1426.4222 1434.2901 1448.4943 1456.1601 1460.6255 1465.1485 1466.2926 1469.4178 1473.2653 1475.2425 1479.5883 1480.2369 1484.6569 1489.0949 1587.7329 1614.9976 1633.3136 2869.7284 2881.5834 2886.9125 2892.2641 2953.8580 2988.1746 3000.1964 3002.8936 3008.9295 3013.2846 3016.5433 3018.9366 3022.6778 3025.8242 3035.5541 3043.6120 3053.1592 3054.0646 3056.7205 3064.2918 3068.0368 3076.6691 3082.2398 3090.3115 3092.8287 3119.3010 3126.9222 3140.9355 3147.9721 3162.1146
redmass: 3.5103 4.8395 3.7032 3.8129 5.7728 3.9897 3.1930 3.7729 2.7188 4.3128 3.9574 3.0243 2.0820 1.0621 3.3872 2.9321 2.6897 4.5985 2.6149 2.7447 4.6332 2.6753 4.0058 2.2351 2.5650 2.8939 2.8389 3.3941 3.4911 4.5184 3.2958 2.3875 2.5462 2.9448 5.9940 5.0992 4.3461 1.9487 5.2711 3.7763 1.7919 4.4309 4.3444 1.8289 1.2599 2.1799 2.5181 2.2601 3.3014 1.2952 1.9779 5.0360 2.7768 1.6672 1.8651 2.3053 1.8071 2.3265 1.9790 1.4393 2.5404 2.8074 5.7051 1.3320 2.1154 2.1233 2.2016 1.6803 2.0127 2.7517 2.1594 2.1298 2.7785 1.6836 2.5494 1.7077 2.1831 2.0930 1.6399 1.3840 1.2318 2.4169 1.3393 1.0753 1.4820 1.2397 1.2079 1.5945 1.5710 1.7289 1.4140 1.4330 1.4155 1.3323 1.2978 1.3682 1.3457 1.3053 1.1919 1.3572 1.3551 1.4795 1.3515 1.4064 1.5304 1.3857 1.4596 1.6470 1.5687 1.4292 5.8343 1.4949 1.1680 2.2766 1.0807 1.0795 1.0690 1.0838 1.0861 1.0833 1.0864 1.0845 1.1035 1.0487 1.0861 2.2111 5.8836 5.9235 9.2838 1.0702 1.0690 1.0538 1.0670 1.0818 1.0615 1.0608 1.0614 1.0643 1.0908 1.0643 1.0649 1.0764 1.0824 1.0884 1.0858 1.0884 1.0869 1.0994 1.1023 1.1015 1.1005 1.1042 1.1042 1.1084 1.0842 1.0875 1.0919 1.0957 1.1014
irintensity: 0.0074 0.1019 0.1585 0.0447 0.9357 0.9631 0.3724 1.2026 0.1584 0.2697 1.0418 1.5603 0.8752 0.0068 2.4929 1.6704 1.3855 6.1557 3.1972 4.4346 3.0477 2.9450 10.2134 2.8471 6.2441 7.9213 0.4196 0.7386 2.7204 1.8197 0.4719 6.5388 7.6774 6.0100 0.5192 2.1071 10.8137 35.1705 5.6456 15.9666 51.7120 0.2869 2.7943 6.4156 0.8646 3.2030 20.0420 0.0883 6.5103 0.3562 5.4240 15.1446 1.1569 4.0493 2.9746 3.1278 4.7835 46.2663 14.2488 0.3368 6.1048 2.6684 0.1506 0.1270 18.9324 38.4493 10.1828 1.7554 23.7572 3.8625 5.3557 0.4102 44.3401 6.1502 352.2812 24.1673 21.8102 7.2675 1.1893 31.1512 16.5475 57.0802 0.8465 0.6453 7.3067 5.7788 0.8037 7.1651 9.0760 9.0170 10.4844 2.1051 27.6017 2.6401 10.5278 1.0801 7.4762 3.0449 9.5910 4.8152 1.1211 1.4318 5.8016 7.1264 6.6568 0.2284 10.8011 3.9091 37.9393 16.5449 1.5627 8.0143 4.3590 7.4381 4.1325 4.5864 11.3352 7.7556 5.9208 10.3138 6.6416 31.0102 4.9817 4.0461 9.6286 26.2352 1.9978 13.0969 138.5017 74.1052 54.9522 76.8753 170.9984 3.2953 32.4335 31.5028 17.9134 34.6327 27.6834 50.8485 23.1998 55.4402 34.6033 16.8037 87.1825 15.1749 7.8358 29.6360 23.3679 1.2184 34.2960 53.3705 62.3246 28.6269 1.5781 5.0164 16.9322 37.2615 23.5614
temp: 298.150 k
press: 1.00000 atm
elementType: 8 8 7 7 6 6 6 6 6 6 6 6 6 6 6 6 6 6 6 6 6 6 6 6 6 1 1 1 1 1 1 1 1 1 1 1 1 1 1 1 1 1 1 1 1 1 1 1 1 1 1 1 1 1 1
symmnumber: 1
zpe: 1244429.0 jmol-1
zpe.correction: 0.473978 hartree
zpe.thermalcorrener: 0.496875 hartree
zpe.thermalcorrenthalpy: 0.497819 hartree
zpe.thermalcorrgfe: 0.418550 hartree
zpe.sumelectzpe: -1076.249419 hartree
zpe.sumelectthermal: -1076.226522 hartree
zpe.sumelectthermalent: -1076.225578 hartree
zpe.sumelectthermalfe: -1076.304847 hartree
dipole: 1.0791 0.1373 1.2342
dipole: 1.6452
quadrupole: -128.3699 -151.0158 -152.4903
quadrupole: 1.1771 -1.1014 -4.8260
quadrupole: 15.5888 -7.0572 -8.5316 1.1771 -1.1014 -4.8260
hfenergy: -1076.7233973 hartree
pointgroup: C01 [X(C21H30N2O2)]
dipole: -0.4202327 -0.0974625 0.4825473 debye
polarizability: 289.4982018|7.2005017|246.834622|-10.0756619|-3.4727638|176.6589719 unknown
InChI: InChI=1S/C21H30N2O2/c1-22-17-10-11-18(22)15-23(14-17)12-13-25-21(24)20-9-5-8-19(20)16-6-3-2-4-7-16/h2-4,6-7,17-20H,5,8-15H2,1H3
charge 0 multiplicity 1
55 atoms
O  0.429979 1.036337 0.643354
O  1.203511 2.204164 -1.219889
N  -5.613143 -1.421816 -0.171928
N  -3.176719 0.034567 0.444321
C  -5.555359 -0.456811 0.975976
C  -4.89815 -0.627091 -1.22492
C  -5.934206 0.941119 0.367764
C  -5.490998 0.824207 -1.12765
C  -4.100687 -0.466041 1.496896
C  -3.395686 -0.643309 -0.861624
C  -1.765542 0.049787 0.879033
C  -6.986367 -1.826381 -0.551002
C  2.790951 1.531948 0.550803
C  3.854815 0.854528 -0.396064
C  3.365766 2.959853 0.886183
C  5.150172 1.683544 -0.165282
C  4.62599 3.125829 -0.002747
C  -0.95614 1.086676 0.089714
C  1.434544 1.640978 -0.124048
C  3.995135 -0.659588 -0.230404
C  2.892228 -1.468314 0.156561
C  5.228622 -1.3069 -0.509107
C  3.019672 -2.871587 0.263494
C  5.358988 -2.709704 -0.404025
C  4.253566 -3.501026 -0.017202
H  -6.234855 -0.781625 1.783366
H  -5.039215 -1.091588 -2.216501
H  -5.401067 1.756687 0.884252
H  -7.019966 1.126146 0.457223
H  -6.347788 0.941975 -1.815639
H  -4.734542 1.583601 -1.387117
H  -3.856929 -1.510057 1.810858
H  -4.008238 0.19379 2.381077
H  -3.056412 -1.707845 -0.836619
H  -2.81978 -0.115279 -1.644346
H  -1.273916 -0.950399 0.782556
H  -1.731137 0.323957 1.949551
H  -7.668022 -0.982368 -0.814188
H  -6.93459 -2.506432 -1.420159
H  -7.442211 -2.384421 0.286476
H  2.671541 0.943138 1.475122
H  3.524628 1.059747 -1.43724
H  3.643437 2.990164 1.955538
H  2.62641 3.760356 0.710924
H  5.867964 1.5853 -0.999179
H  5.656987 1.345895 0.760231
H  5.370625 3.808653 0.443715
H  4.340315 3.534529 -0.990229
H  -0.911255 0.87525 -0.992722
H  -1.363179 2.102441 0.23497
H  1.925221 -1.004492 0.381779
H  6.097918 -0.712402 -0.810834
H  2.154363 -3.472821 0.566149
H  6.322753 -3.183737 -0.623424
H  4.352594 -4.58923 0.065404
