program: Gaussian 09
title: 000115595
version: EM64L-G09RevD.01
frameworkgroup: C1[X(C13H20N2O3)]
method: RPBEPBE
basis: SDD
operation: Freq
keyword: #p
keyword: freq=noraman
keyword: PBEPBE/SDD
title: #p freq=noraman PBEPBE/SDD
converged: YES YES NO NO
title: Mulliken charges:
elementType: O O O N N C C C C C C C C C C C C C H H H H H H H H H H H H H H H H H H H H
charge: -0.216021 -0.220411 -0.221635 -0.373955 -0.387048 0.040146 -0.165144 0.013041 -0.102029 -0.535400 -0.462647 -0.765424 0.131301 0.155913 -0.759429 -0.363043 0.149706 -0.697283 0.266643 0.253401 0.272359 0.247323 0.208841 0.197555 0.194214 0.236608 0.218455 0.227025 0.236216 0.228141 0.218007 0.200421 0.207669 0.366002 0.362349 0.209297 0.211394 0.217443
chargesum: 0.00000
title: Mulliken charges with hydrogens summed into heavy atoms:
elementType: O O O N N C C C C C C C C C C C C C
charge: -0.216021 -0.220411 -0.221635 -0.007952 -0.024699 0.040146 0.101498 0.266442 0.170331 -0.079236 -0.070878 -0.083336 0.131301 0.155913 -0.077065 0.045047 0.149706 -0.059150
polarizability: 2.08920937e+02 -6.43377942e+00 1.31638379e+02 -3.05541543e+00 -2.81582026e+00 1.39912244e+02
1716.lowfreq: -18.5304 -8.4205 -0.0008 -0.0007 -0.0003 3.2981 8.2225 34.1453 69.7836
frequency: 6.9050 33.4736 69.7661 86.9513 101.9178 121.8055 133.7418 149.5787 155.0626 177.0974 181.4896 208.3290 223.6906 232.4439 239.0937 244.0518 290.7789 353.3796 357.5776 373.6901 388.9345 428.9484 457.0732 482.0514 483.6307 521.6573 580.2857 586.7219 651.2244 661.9160 675.9601 696.8741 714.8032 740.0509 763.4792 787.7222 821.2903 853.1492 888.3535 894.8245 909.4944 932.3168 946.9827 977.1626 990.1650 1010.0135 1022.4740 1045.6592 1058.7701 1084.5112 1098.4343 1108.1124 1111.5324 1140.7856 1153.8596 1164.8029 1191.9596 1213.7624 1236.9759 1253.7491 1280.4121 1285.4316 1289.2570 1299.9395 1301.4929 1317.7830 1333.9060 1343.7211 1352.7698 1353.4276 1372.9478 1374.8053 1378.6898 1388.2553 1388.9893 1394.2486 1456.8381 1465.0092 1472.3643 1474.7242 1474.8450 1477.0314 1480.9097 1483.6300 1486.2477 1605.8541 1640.7878 1677.7991 2947.5229 2969.8201 2972.4060 2974.0848 2975.2922 2979.7338 2990.3756 2993.6698 2999.1307 3007.3843 3026.8179 3062.2944 3066.7966 3067.9368 3068.7918 3072.3875 3074.8398 3075.6735 3517.0886 3521.2473
redmass: 7.7736 3.9942 2.5587 1.9234 2.4227 3.4698 4.8775 3.3480 10.4860 4.1730 4.1582 1.6720 1.5550 1.1757 2.3832 1.2087 2.3815 6.3284 4.8563 3.1374 8.8558 2.5852 3.3299 4.4226 4.7907 3.7667 4.1989 6.2570 4.7257 2.7184 2.2803 4.5733 4.1317 1.1295 1.9588 1.5942 2.0725 1.2893 2.0349 2.7981 1.4350 1.8861 2.9014 2.0688 3.4041 2.2995 1.8214 2.6937 1.5229 2.4240 2.6171 3.1521 1.9179 2.3061 2.5677 2.7626 2.7226 1.6263 1.5018 1.3011 1.2757 1.3235 1.1173 2.4236 1.5781 1.3337 1.3944 1.4055 1.7150 1.6849 3.8703 1.4898 2.4739 1.2149 1.2198 1.2190 1.0792 1.0810 1.0537 1.0539 1.0538 1.0432 1.0491 1.0476 1.0772 6.5205 8.3032 5.5308 1.0591 1.0573 1.0381 1.0363 1.0362 1.0833 1.0926 1.0742 1.0753 1.0902 1.1019 1.1011 1.0990 1.0990 1.1003 1.0993 1.0994 1.0992 1.0764 1.0775
irintensity: 0.7891 0.1471 0.2618 0.1144 0.0862 0.1524 0.1749 0.2029 11.5410 2.6947 0.1234 1.7471 1.4794 0.0829 0.8532 0.1684 0.3688 19.8598 16.0710 3.6923 0.8212 0.9609 1.5220 14.7435 11.7717 14.4168 1.9779 2.0642 1.3165 9.8165 11.3737 7.6094 3.7153 6.7734 0.0450 218.9631 0.7193 2.8660 4.2061 1.3046 4.7611 3.1103 4.2753 0.5742 0.3990 2.9207 7.0920 1.1445 8.2018 7.2136 2.1069 1.2665 11.2501 13.6204 0.6055 5.2459 35.6242 14.6076 16.3560 6.3624 11.3925 23.2363 0.4711 285.2463 95.4527 6.4910 10.5643 10.4508 65.8837 37.4563 116.8134 9.7758 41.3688 12.2076 19.3643 15.1255 3.1503 7.4954 2.8553 4.2299 14.0683 12.8488 8.6605 14.0407 16.1596 270.6576 68.9822 647.8650 18.9950 53.2906 34.1617 30.1609 17.8095 0.9558 2.1035 18.1061 16.6804 8.5832 43.0091 15.1445 14.5735 35.2422 70.8887 50.1181 14.4460 48.6671 71.9457 59.5483
temp: 298.150 k
press: 1.00000 atm
elementType: 8 8 8 7 7 6 6 6 6 6 6 6 6 6 6 6 6 6 1 1 1 1 1 1 1 1 1 1 1 1 1 1 1 1 1 1 1 1
symmnumber: 1
zpe: 834315.8 jmol-1
zpe.correction: 0.317774 hartree
zpe.thermalcorrener: 0.336372 hartree
zpe.thermalcorrenthalpy: 0.337316 hartree
zpe.thermalcorrgfe: 0.269798 hartree
zpe.sumelectzpe: -841.232469 hartree
zpe.sumelectthermal: -841.213871 hartree
zpe.sumelectthermalent: -841.212927 hartree
zpe.sumelectthermalfe: -841.280445 hartree
dipole: -1.6484 0.3135 0.0657
dipole: 1.6792
quadrupole: -118.3022 -105.6921 -117.1267
quadrupole: 2.1146 0.9860 3.3532
quadrupole: -4.5952 8.0149 -3.4197 2.1146 0.9860 3.3532
hfenergy: -841.5502435 hartree
pointgroup: C01 [X(C13H20N2O3)]
dipole: 0.6552831 -0.08335 -0.0106402 debye
polarizability: 209.4584693|-2.2118848|130.2830669|1.7618393|-0.9777731|140.7300231 unknown
InChI: InChI=1S/C13H20N2O3/c1-4-5-9-6-7(2)13(8(9)3)10(16)14-12(18)15-11(13)17/h7-9,14-15H,4-6H2,1-3H3
charge 0 multiplicity 1
38 atoms
O  -1.18599 -0.466449 2.525035
O  -0.407628 0.18155 -2.244994
O  -4.661438 0.438136 -0.416577
N  -2.876856 -0.015139 1.025424
N  -2.492017 0.291939 -1.278974
C  -0.506332 -0.200974 0.184938
C  0.65311 0.820081 0.537258
C  1.900562 0.321021 -0.258335
C  0.302698 -1.566617 0.155901
C  1.661973 -1.203226 -0.50438
C  3.220298 0.646807 0.482069
C  0.303035 2.302767 0.317878
C  -1.521408 -0.239599 1.331645
C  -1.09706 0.100655 -1.192528
C  -0.429477 -2.753978 -0.492961
C  4.485669 0.38956 -0.368123
C  -3.43254 0.251752 -0.23702
C  5.791255 0.700072 0.39516
H  0.839537 0.651806 1.618161
H  1.911034 0.834918 -1.238683
H  0.474468 -1.792406 1.227172
H  1.620762 -1.413877 -1.586853
H  2.469706 -1.824208 -0.072092
H  3.273605 0.045502 1.414691
H  3.217229 1.711671 0.797251
H  0.080885 2.513005 -0.744473
H  -0.563182 2.618688 0.929362
H  1.157353 2.940056 0.609561
H  -0.633988 -2.565954 -1.563037
H  0.199587 -3.66056 -0.432195
H  -1.385169 -2.982468 0.015719
H  4.435549 1.007134 -1.288049
H  4.496882 -0.666638 -0.705032
H  -3.539784 -0.049324 1.806868
H  -2.87036 0.487351 -2.212058
H  5.818902 1.757477 0.720126
H  5.881035 0.069751 1.300028
H  6.681396 0.517121 -0.234282
