program: Gaussian 09
title: 000115558
version: EM64L-G09RevD.01
frameworkgroup: C1[X(C12H18N2O3)]
method: RPBEPBE
basis: SDD
operation: Freq
keyword: #p
keyword: freq=noraman
keyword: PBEPBE/SDD
title: #p freq=noraman PBEPBE/SDD
converged: YES YES NO NO
title: Mulliken charges:
elementType: O O O N N C C C C C C C C C C C C H H H H H H H H H H H H H H H H H H
charge: -0.207723 -0.215008 -0.222969 -0.374603 -0.384383 0.050930 -0.040783 -0.092238 -0.473022 -0.428095 -0.419541 -0.410215 0.136820 0.154980 -0.748532 -0.722777 0.141353 0.223681 0.220407 0.242562 0.204781 0.204025 0.236856 0.205633 0.205834 0.226680 0.209358 0.237187 0.221420 0.236952 0.219659 0.217089 0.218234 0.362227 0.363220
chargesum: 0.00000
title: Mulliken charges with hydrogens summed into heavy atoms:
elementType: O O O N N C C C C C C C C C C C C
charge: -0.207723 -0.215008 -0.222969 -0.012376 -0.021163 0.050930 0.182898 0.128169 -0.025679 0.012787 -0.008074 0.025823 0.136820 0.154980 -0.052973 -0.067794 0.141353
polarizability: 1.73982802e+02 2.19057309e+00 1.29841423e+02 -1.79632671e-01 2.79030858e+00 1.36146650e+02
1716.lowfreq: -0.0010 -0.0009 -0.0005 5.4138 9.9770 11.7081 40.6514 64.6766 86.9082
frequency: 40.5955 64.6436 86.8609 123.6877 139.3783 148.6450 159.0146 166.3973 187.2930 201.2555 221.2409 243.4903 281.4690 287.1608 322.2839 356.1103 368.5758 378.4621 424.5384 449.9772 481.4275 487.3574 504.0450 574.6598 608.4154 641.0004 649.9793 651.4673 691.9367 708.1297 749.3829 769.9713 777.7164 822.4965 851.7699 862.3427 885.2034 918.8353 937.5011 965.5857 987.7490 991.1571 999.6970 1028.1076 1041.7562 1062.2638 1077.7202 1094.4040 1122.7174 1144.5516 1154.6810 1180.3671 1198.0413 1212.4604 1263.9340 1268.0903 1292.5434 1298.5023 1312.3952 1320.7962 1331.1586 1343.3865 1348.4962 1357.4446 1363.1353 1364.7922 1373.0366 1374.1564 1391.3655 1396.9604 1461.1954 1465.5184 1470.3477 1472.0675 1478.8155 1481.5715 1485.7456 1488.8515 1610.2198 1646.1039 1675.8403 2970.2830 2975.7690 2978.1341 2980.3592 2987.8638 2991.6214 2996.2655 3001.0261 3032.6033 3034.3472 3048.2301 3065.2447 3073.1543 3077.8783 3083.5822 3100.0901 3519.0430 3521.0525
redmass: 7.1120 2.3563 3.0634 2.8860 4.6142 4.4163 4.3024 3.2029 1.6999 1.9290 2.0177 2.0583 3.6103 2.1952 3.2761 9.9454 4.6635 3.8914 2.3887 2.7504 2.7148 7.2894 4.9225 3.7416 3.1224 3.6763 2.3330 3.4458 4.0759 3.5977 1.9469 1.3334 1.6737 2.3694 2.4776 1.5296 2.5661 2.5126 2.0817 1.6467 2.1856 2.7432 2.2215 1.8982 1.9591 2.1222 1.9413 1.7477 2.0617 2.8334 2.3017 3.7818 1.7063 1.7200 1.3109 1.3194 3.3268 1.3422 1.3567 1.2768 1.3061 1.3702 1.4797 1.3706 1.4472 7.4870 1.6823 1.7919 1.2070 1.2074 1.0771 1.0695 1.0639 1.0655 1.0545 1.0699 1.0580 1.0723 6.7302 8.3246 5.6814 1.0800 1.0559 1.0406 1.0612 1.0801 1.0529 1.0507 1.0625 1.0998 1.0982 1.1019 1.1018 1.0991 1.1004 1.0990 1.0994 1.0760 1.0780
irintensity: 0.4277 0.0560 0.1161 0.3374 1.1419 2.8499 7.0588 1.3039 0.5554 0.1224 0.0733 0.7418 5.5704 0.0872 1.3118 21.7637 7.1680 0.5205 4.2615 2.2417 7.6708 10.7865 25.1259 3.4462 3.5293 9.9075 2.8490 16.4094 10.3327 6.8419 6.8985 11.6440 190.6932 3.4271 2.8691 3.4158 18.6726 6.2609 18.4597 1.6859 3.5917 1.9813 10.4225 1.2222 5.8279 7.6043 22.8782 1.1340 4.2210 14.1019 4.2316 22.9588 25.7550 9.1812 4.9302 6.2112 290.1436 7.2123 48.1310 3.5703 2.0979 1.0642 10.3525 1.2980 1.1012 207.7004 14.2107 8.0421 14.4904 14.9323 4.1343 13.3061 9.1361 16.2719 16.8846 4.4496 14.0812 2.4766 267.1515 114.0221 615.5073 13.0199 39.9536 21.0448 28.5984 6.4800 26.9007 56.8076 27.8354 15.9662 33.9934 24.1425 31.1402 48.7841 44.2115 26.0309 24.6881 81.4858 46.5654
temp: 298.150 k
press: 1.00000 atm
elementType: 8 8 8 7 7 6 6 6 6 6 6 6 6 6 6 6 6 1 1 1 1 1 1 1 1 1 1 1 1 1 1 1 1 1 1
symmnumber: 1
zpe: 765962.9 jmol-1
zpe.correction: 0.291740 hartree
zpe.thermalcorrener: 0.308146 hartree
zpe.thermalcorrenthalpy: 0.309090 hartree
zpe.thermalcorrgfe: 0.248794 hartree
zpe.sumelectzpe: -802.002305 hartree
zpe.sumelectthermal: -801.985899 hartree
zpe.sumelectthermalent: -801.984954 hartree
zpe.sumelectthermalfe: -802.045250 hartree
dipole: -1.2254 -1.5337 0.3655
dipole: 1.9968
quadrupole: -111.5180 -98.5514 -109.2604
quadrupole: 0.5164 0.5176 -2.4681
quadrupole: -5.0747 7.8919 -2.8171 0.5164 0.5176 -2.4681
hfenergy: -802.2940444 hartree
pointgroup: C01 [X(C12H18N2O3)]
dipole: 0.4778166 0.6024021 0.1612433 debye
polarizability: 173.9506658|2.4833068|130.0317572|0.3246844|-2.9545455|135.9884518 unknown
InChI: InChI=1S/C12H18N2O3/c1-3-8-6-4-5-7(2)12(8)9(15)13-11(17)14-10(12)16/h7-8,13-14H,3-6H2,1-2H3
charge 0 multiplicity 1
35 atoms
O  -0.376045 -1.028534 2.265157
O  0.123912 0.035928 -2.376402
O  -4.073618 -0.293324 -0.4358
N  -2.191271 -0.527497 0.93551
N  -1.935985 -0.033358 -1.352347
C  0.096974 0.09255 0.107792
C  1.532071 -0.539828 0.185894
C  0.122025 1.673228 0.455774
C  2.606769 0.277416 -0.578225
C  1.190857 2.381062 -0.418414
C  2.598737 1.780336 -0.220719
C  1.515223 -2.030891 -0.259457
C  -0.800943 -0.560903 1.178123
C  -0.522443 -0.001774 -1.297678
C  0.339275 1.953042 1.963738
C  2.798839 -2.800166 0.122118
C  -2.826157 -0.27155 -0.291777
H  1.787621 -0.528364 1.264827
H  -0.87437 2.079072 0.182729
H  2.444004 0.160069 -1.664729
H  3.599605 -0.149932 -0.34391
H  1.187903 3.457209 -0.156625
H  0.917568 2.308001 -1.488037
H  3.32421 2.318219 -0.860137
H  2.931519 1.926873 0.826185
H  1.363849 -2.083529 -1.355158
H  0.654517 -2.543473 0.215227
H  1.226652 1.437991 2.367123
H  0.481656 3.03983 2.106838
H  -0.525964 1.644089 2.574414
H  3.689761 -2.399083 -0.393365
H  2.980997 -2.748591 1.211933
H  2.71053 -3.866853 -0.154126
H  -2.803906 -0.826099 1.701496
H  -2.361772 0.046234 -2.281774
