program: Gaussian 09
title: 000115546
version: EM64L-G09RevD.01
frameworkgroup: C1[X(C12H18N2O3)]
method: RPBEPBE
basis: SDD
operation: Freq
keyword: #p
keyword: freq=noraman
keyword: PBEPBE/SDD
title: #p freq=noraman PBEPBE/SDD
converged: YES YES NO NO
title: Mulliken charges:
elementType: O O O N N C C C C C C C C C C C C H H H H H H H H H H H H H H H H H H
charge: -0.222147 -0.220831 -0.221365 -0.378148 -0.378842 0.081196 -0.108668 -0.110222 -0.088262 -0.090286 -0.778333 -0.777929 0.134626 0.132730 -0.768644 -0.767873 0.148932 0.264043 0.264107 0.234926 0.237285 0.209997 0.250879 0.225521 0.227676 0.211463 0.247967 0.214345 0.219927 0.221015 0.219952 0.221790 0.213557 0.364896 0.364720
chargesum: 0.00000
title: Mulliken charges with hydrogens summed into heavy atoms:
elementType: O O O N N C C C C C C C C C C C C
charge: -0.222147 -0.220831 -0.221365 -0.013252 -0.014123 0.081196 0.155375 0.153885 0.146664 0.146999 -0.091935 -0.090824 0.134626 0.132730 -0.113357 -0.112575 0.148932
polarizability: 1.88433352e+02 -5.20332611e-01 1.30753736e+02 -2.33000604e-01 -5.32854061e+00 1.26351232e+02
1716.lowfreq: -14.0424 -8.5707 -0.0005 -0.0005 0.0004 6.0014 17.3414 25.2072 91.7230
frequency: 17.0961 23.8359 91.7164 125.7805 154.8681 158.5131 180.9593 194.5035 198.9717 205.2578 207.6306 239.4877 247.5923 265.3412 274.7126 295.9076 312.0743 356.9253 387.4202 402.3239 449.0670 463.3291 482.0064 482.6209 496.9504 531.3232 612.4776 640.5391 664.0076 678.4360 704.5117 713.0649 764.2414 788.1711 810.6147 839.6130 891.3012 915.1152 950.2784 964.7520 965.2881 977.4114 1001.1819 1001.8164 1050.2410 1064.5706 1088.7852 1114.2594 1121.9271 1132.4053 1164.2341 1179.7115 1192.3165 1197.1576 1241.2163 1266.6452 1291.0386 1308.2615 1311.3118 1331.1022 1338.1148 1357.4485 1361.3022 1373.4616 1374.3486 1375.5574 1384.4106 1389.5750 1395.2082 1395.8955 1471.2283 1473.8135 1475.9169 1477.4811 1484.2674 1487.5419 1488.8507 1491.4852 1604.5413 1640.6274 1677.9188 2957.5170 2969.3046 2972.9455 2974.2803 2979.1407 2980.2789 2991.4524 2998.3013 3064.7989 3065.5063 3067.1940 3067.7838 3071.1282 3073.6097 3087.9468 3091.3957 3518.4211 3520.0319
redmass: 4.3042 5.5747 2.9697 4.5317 5.0584 10.5489 3.2842 2.8976 1.1271 2.0529 1.4376 1.2219 1.2140 2.0591 1.9885 3.2733 2.9939 11.6407 11.8976 2.9489 2.8896 3.3523 4.0817 8.7253 2.8148 6.7043 6.3278 4.5509 2.5203 2.4457 5.4983 2.8310 1.9778 1.5787 1.8510 2.2271 1.9533 5.1326 1.6359 1.5943 1.5345 2.0260 1.9460 1.7685 2.2679 2.6591 2.1280 2.5837 3.3458 2.4747 2.0040 2.2491 2.6090 4.2904 1.4572 1.3187 1.7340 1.6040 1.5751 1.5627 1.5132 1.5548 1.5650 3.6675 1.5319 2.2046 1.2277 1.2120 1.2018 1.1978 1.0584 1.0425 1.0515 1.0444 1.0432 1.0534 1.0537 1.0455 6.4649 8.2065 5.5497 1.0810 1.0803 1.0387 1.0369 1.0374 1.0378 1.0840 1.0856 1.0981 1.0977 1.0978 1.0985 1.0981 1.0979 1.0997 1.0995 1.0757 1.0782
irintensity: 0.1895 1.0046 0.0016 0.0128 0.2400 12.4467 1.4396 0.1833 0.1202 4.1302 1.7369 0.4861 0.7683 0.0819 0.0458 4.9084 1.0417 28.5591 0.8466 3.1835 1.5338 0.3116 2.0188 16.2102 1.7113 29.7161 0.6590 5.8349 0.8571 26.3028 0.0589 3.8750 0.2491 210.4300 0.1097 3.0248 0.8745 4.9811 8.4782 2.2055 3.5514 6.5884 11.2498 11.8346 3.6387 2.8063 39.0033 4.2392 1.3791 1.6031 1.2676 2.0902 12.3297 33.9849 4.1310 4.2783 211.2339 115.4680 107.4837 13.8125 28.9865 54.4507 24.5760 147.7028 1.4886 11.8408 7.7106 13.0177 26.0368 11.7805 0.5116 43.3008 8.5171 3.2443 17.3016 10.8792 15.1068 10.9977 263.5510 57.9797 638.4644 0.1800 4.9437 32.7982 38.9748 33.3539 17.9521 1.0013 19.8202 9.7027 5.7207 59.4326 48.5970 58.7285 14.8355 16.9174 18.1481 87.3654 43.8667
temp: 298.150 k
press: 1.00000 atm
elementType: 8 8 8 7 7 6 6 6 6 6 6 6 6 6 6 6 6 1 1 1 1 1 1 1 1 1 1 1 1 1 1 1 1 1 1
symmnumber: 1
zpe: 760551.3 jmol-1
zpe.correction: 0.289679 hartree
zpe.thermalcorrener: 0.306828 hartree
zpe.thermalcorrenthalpy: 0.307773 hartree
zpe.thermalcorrgfe: 0.244868 hartree
zpe.sumelectzpe: -802.010139 hartree
zpe.sumelectthermal: -801.992990 hartree
zpe.sumelectthermalent: -801.992045 hartree
zpe.sumelectthermalfe: -802.054950 hartree
dipole: -1.7058 -0.0990 -0.0468
dipole: 1.7093
quadrupole: -110.6202 -100.8412 -108.9059
quadrupole: 0.2156 0.1065 5.3235
quadrupole: -3.8311 5.9479 -2.1168 0.2156 0.1065 5.3235
hfenergy: -802.2998181 hartree
pointgroup: C01 [X(C12H18N2O3)]
dipole: 0.6716915 -0.0298387 0.0130469 debye
polarizability: 187.5234901|-6.4319778|132.0762003|3.8838802|4.6426317|125.9386299 unknown
InChI: InChI=1S/C12H18N2O3/c1-5-6(2)8(4)12(7(5)3)9(15)13-11(17)14-10(12)16/h5-8,13-14H,1-4H3
charge 0 multiplicity 1
35 atoms
O  -0.408976 -1.304471 -2.07542
O  -0.32951 1.266244 2.062061
O  -4.282839 0.45768 -0.226986
N  -2.304441 -0.442423 -1.091675
N  -2.254099 0.87698 0.859285
C  -0.066489 -0.027711 -0.007753
C  0.808503 -1.139488 0.746929
C  1.02923 0.925437 -0.696039
C  2.25015 -0.975545 0.190559
C  2.372644 0.558275 -0.008992
C  0.245806 -2.571494 0.709477
C  0.684007 2.425159 -0.71883
C  -0.910002 -0.642183 -1.127341
C  -0.864438 0.743819 1.047404
C  3.320642 -1.585351 1.11428
C  3.601294 1.000258 -0.825244
C  -3.037803 0.308741 -0.15848
H  0.839937 -0.798703 1.801444
H  1.099177 0.562011 -1.741211
H  2.303476 -1.462502 -0.806445
H  2.401518 1.039288 0.991835
H  -0.7864 -2.620226 1.106018
H  0.244805 -2.9815 -0.31521
H  0.865265 -3.232613 1.341809
H  1.446764 2.97602 -1.297697
H  -0.291309 2.617506 -1.205492
H  0.655746 2.852548 0.298791
H  3.285198 -1.120822 2.118719
H  3.180192 -2.674634 1.238246
H  4.335792 -1.431798 0.705063
H  3.633697 2.097708 -0.952794
H  4.540463 0.70212 -0.324844
H  3.591388 0.539975 -1.832214
H  -2.849369 -0.863951 -1.851257
H  -2.765017 1.416644 1.565903
