program: Gaussian 09
title: 000115526
version: EM64L-G09RevD.01
frameworkgroup: C1[X(C11H16N2O3)]
method: RPBEPBE
basis: SDD
operation: Freq
keyword: #p
keyword: freq=noraman
keyword: PBEPBE/SDD
title: #p freq=noraman PBEPBE/SDD
converged: YES YES NO NO
title: Mulliken charges:
elementType: O O O N N C C C C C C C C C C C H H H H H H H H H H H H H H H H
charge: -0.219307 -0.220752 -0.220488 -0.385355 -0.382650 0.032177 -0.045261 -0.074183 -0.495153 -0.470215 -0.437004 0.147653 0.134094 -0.757284 -0.710232 0.149309 0.264392 0.268263 0.223966 0.224977 0.224220 0.227327 0.243833 0.202325 0.226322 0.246708 0.213552 0.217524 0.219410 0.224667 0.363443 0.363724
chargesum: 0.00000
title: Mulliken charges with hydrogens summed into heavy atoms:
elementType: O O O N N C C C C C C C C C C C
charge: -0.219307 -0.220752 -0.220488 -0.021913 -0.018926 0.032177 0.219131 0.194080 -0.046211 -0.018668 0.009154 0.147653 0.134094 -0.070702 -0.048631 0.149309
polarizability: 1.64192879e+02 4.16553429e-01 1.23915831e+02 -3.79904933e-01 5.80730593e+00 1.19404006e+02
1716.lowfreq: -10.0936 -3.0469 -0.0008 -0.0004 -0.0002 14.1653 27.0102 33.9795 103.8041
frequency: 26.8410 33.8708 103.7685 121.6000 142.5958 161.5393 179.1187 185.8669 199.6683 217.7330 250.1645 259.7274 274.0361 340.9172 355.3434 384.0356 409.9001 440.0713 448.4669 483.5022 521.6787 551.5877 580.9720 634.8033 653.6880 664.4730 679.9162 695.2134 760.6510 784.2820 794.4005 844.0106 882.0997 889.1786 936.1353 952.0728 961.9150 984.8312 988.2382 1007.5649 1017.9965 1037.4390 1071.7880 1105.4993 1122.7111 1138.0964 1154.4576 1185.6324 1201.3559 1208.9509 1263.2161 1284.5169 1290.5680 1297.7426 1322.1865 1324.6522 1340.4789 1353.3886 1360.2310 1373.9554 1374.8855 1375.8794 1393.2336 1394.3238 1467.2184 1471.6299 1475.8730 1476.5970 1481.5860 1484.4148 1487.8032 1605.8027 1641.4465 1677.9149 2975.0933 2978.0816 2982.4467 2988.5925 2995.0933 2998.6050 3003.0563 3040.4118 3058.7055 3066.3841 3068.2793 3072.6868 3076.1359 3087.2219 3518.2546 3520.0101
redmass: 3.2273 7.3604 2.5410 3.6106 5.5829 10.1378 2.3172 1.8464 3.0124 2.2282 1.2715 3.2615 1.8820 2.9940 12.1846 9.2915 3.9087 2.6071 2.7639 9.7228 3.8850 2.4484 5.3330 4.1667 3.1629 2.8168 3.3071 4.3913 1.8975 1.5453 1.2792 1.7393 3.5012 2.3293 1.4739 2.0192 1.8714 2.7710 2.6775 2.7214 1.5697 2.0813 2.6110 2.3660 2.4719 1.9688 2.4170 2.7689 1.8047 2.0169 1.2485 1.3208 2.1894 1.3783 1.3463 1.6845 1.4140 1.5357 1.7866 1.6209 2.4740 2.2265 1.2109 1.2175 1.0842 1.0848 1.0573 1.0580 1.0575 1.0630 1.0536 6.4811 8.1301 5.5517 1.0362 1.0368 1.0640 1.0799 1.0681 1.0717 1.0692 1.0968 1.1022 1.0982 1.1005 1.1038 1.0992 1.0995 1.0758 1.0781
irintensity: 0.0378 1.1526 0.4473 0.1931 0.3232 11.2938 0.6361 0.9027 1.2692 0.8866 0.7105 6.4344 0.5212 2.5968 27.0253 3.8025 5.3992 0.4223 5.4125 16.3040 16.4397 0.8773 3.5312 8.5733 6.3153 2.2509 6.6094 9.9544 1.4346 225.3365 5.4184 0.5203 6.3543 4.7697 4.9499 23.5027 7.4644 1.6191 2.8321 0.4499 1.3966 10.0334 19.4941 3.5797 2.6336 0.8132 1.6018 9.0857 17.9685 21.9492 10.1344 5.6545 239.3406 57.6772 24.2257 89.1371 7.4542 3.2521 97.3757 33.3773 46.2664 49.6790 14.2070 14.7411 5.0688 3.2831 20.3307 11.4503 16.7075 19.6305 13.2828 266.7556 57.4310 613.9525 25.6774 24.6095 18.1652 8.2778 18.7806 22.4923 19.4591 1.5119 15.1610 28.0586 44.7661 47.7168 41.9744 26.5027 85.9102 44.0490
temp: 298.150 k
press: 1.00000 atm
elementType: 8 8 8 7 7 6 6 6 6 6 6 6 6 6 6 6 1 1 1 1 1 1 1 1 1 1 1 1 1 1 1 1
symmnumber: 1
zpe: 690717.9 jmol-1
zpe.correction: 0.263081 hartree
zpe.thermalcorrener: 0.278481 hartree
zpe.thermalcorrenthalpy: 0.279425 hartree
zpe.thermalcorrgfe: 0.220485 hartree
zpe.sumelectzpe: -762.781590 hartree
zpe.sumelectthermal: -762.766190 hartree
zpe.sumelectthermalent: -762.765245 hartree
zpe.sumelectthermalfe: -762.824186 hartree
dipole: -1.6278 -0.2244 0.1013
dipole: 1.6463
quadrupole: -103.2516 -92.2716 -102.9291
quadrupole: 0.6791 -0.0769 -5.0106
quadrupole: -3.7675 7.2125 -3.4450 0.6791 -0.0769 -5.0106
hfenergy: -763.0446708 hartree
pointgroup: C01 [X(C11H16N2O3)]
dipole: 0.6231568 -0.164385 -0.0647896 debye
polarizability: 163.3589109|-5.4198711|124.5609968|-2.843369|-5.5182273|119.5928083 unknown
InChI: InChI=1S/C11H16N2O3/c1-3-7-5-4-6(2)11(7)8(14)12-10(16)13-9(11)15/h6-7,12-13H,3-5H2,1-2H3
charge 0 multiplicity 1
32 atoms
O  0.041722 -1.030746 2.265693
O  0.146166 0.842211 -2.227331
O  -3.838209 0.281377 0.086283
N  -1.856367 -0.407761 1.120327
N  -1.79922 0.561942 -1.025205
C  0.376822 -0.229542 -0.031682
C  1.649069 0.632219 0.432232
C  1.02554 -1.578516 -0.645527
C  2.868826 -0.075173 -0.210349
C  2.488317 -1.566321 -0.143831
C  1.592537 2.155782 0.196665
C  -0.460227 -0.575985 1.202951
C  -0.401346 0.438352 -1.166571
C  0.251607 -2.881134 -0.378006
C  0.478722 2.878958 0.986656
C  -2.58922 0.152424 0.06149
H  1.712193 0.453097 1.524355
H  1.054571 -1.397427 -1.737897
H  3.800363 0.161819 0.334395
H  2.991905 0.24833 -1.261598
H  3.129817 -2.213431 -0.769228
H  2.538342 -1.93257 0.899143
H  1.495802 2.367655 -0.884088
H  2.57458 2.565878 0.50781
H  0.75908 -3.720457 -0.887715
H  0.213292 -3.117932 0.699788
H  -0.783779 -2.8402 -0.766247
H  -0.53085 2.56208 0.663129
H  0.562717 2.679165 2.071501
H  0.536174 3.972488 0.839028
H  -2.403338 -0.687227 1.941431
H  -2.305706 0.983648 -1.810903
