program: Gaussian 09
title: 000115456
version: EM64L-G09RevD.01
frameworkgroup: C1[X(C12H17NO5)]
method: RPBEPBE
basis: SDD
operation: Freq
keyword: #p
keyword: freq=noraman
keyword: PBEPBE/SDD
title: #p freq=noraman PBEPBE/SDD
converged: YES YES NO NO
title: Mulliken charges:
elementType: O O O O O N C C C C C C C C C C C C H H H H H H H H H H H H H H H H H
charge: -0.244793 -0.421249 -0.449318 -0.264553 -0.434975 -0.618318 -0.177114 -0.607703 0.527950 -0.078346 0.289515 -0.055957 -0.597438 -0.403530 -0.691619 0.296275 -0.191594 -0.407556 0.251453 0.223505 0.250673 0.243825 0.206643 0.248793 0.234556 0.284816 0.286518 0.231209 0.237146 0.230026 0.234643 0.266508 0.386645 0.355227 0.358139
chargesum: 0.00000
title: Mulliken charges with hydrogens summed into heavy atoms:
elementType: O O O O O N C C C C C C C C C C C C
charge: -0.244793 -0.034604 -0.094091 -0.264553 -0.076837 -0.046984 0.074338 -0.133525 0.527950 0.165479 0.289515 0.150686 -0.348645 -0.168975 0.006763 0.296275 0.043049 -0.141049
polarizability: 1.32962379e+02 -1.16623669e+01 1.67332263e+02 -1.24522054e-01 3.61627566e-01 1.46137713e+02
1716.lowfreq: -10.4218 -6.7259 0.0005 0.0008 0.0010 4.9042 32.2037 35.5943 54.4319
frequency: 32.0960 35.4058 54.3952 64.4566 78.9793 83.5216 89.0789 112.3793 128.6608 174.0807 194.6071 212.9094 221.4520 245.8978 253.0224 274.8674 284.1697 298.8148 326.3092 370.7561 373.8469 402.6105 428.4418 430.5638 447.4976 466.3352 516.2737 522.9740 561.3685 602.3537 616.0134 634.3060 682.2888 692.8712 709.3565 748.9553 790.8975 802.0683 828.9721 843.8653 862.4929 894.3140 922.0108 934.1154 946.6660 976.7425 984.4890 995.8983 1025.6345 1050.1419 1075.4942 1085.6934 1115.0462 1123.1150 1134.0980 1148.5980 1152.9311 1173.5258 1181.8098 1184.0972 1206.3051 1250.4965 1269.7745 1285.8944 1302.5677 1316.4681 1324.0316 1329.2972 1375.0672 1384.3625 1391.0729 1395.9016 1411.8981 1439.5305 1463.1448 1472.4207 1475.9363 1493.2009 1606.3856 1611.9582 1612.7012 1644.7685 2924.8308 2955.1576 2967.3456 2990.3231 3007.9316 3067.0389 3110.6962 3110.8431 3117.6738 3134.5286 3155.0998 3176.6392 3470.2537 3502.7363 3508.5882 3576.8461 3634.8547
redmass: 5.7040 5.8727 4.2805 4.7803 3.3408 3.0722 3.3674 2.6995 2.0021 6.6802 1.2840 4.1900 3.6732 1.2231 2.6594 4.5402 4.0521 3.2402 3.5241 4.1522 1.1525 3.0394 2.9234 1.5867 2.9315 3.4848 7.4131 4.1919 4.1713 1.2522 4.7636 4.7370 3.1382 2.4256 6.0280 4.2706 2.5811 2.0213 3.1955 2.5210 1.9342 1.4402 3.0332 2.2839 2.4198 1.3263 5.9566 2.3208 3.1786 2.8190 1.6491 1.7857 5.0272 1.8213 1.5515 2.6879 1.2079 1.1084 1.3839 1.3792 1.1078 1.1627 1.6863 1.9785 1.1892 1.3518 1.2642 1.1983 1.2509 1.7522 5.5530 1.7797 1.5723 2.6918 1.0550 1.1528 1.0674 2.4856 6.0868 4.5842 6.1999 1.2402 1.0826 1.0828 1.0858 1.0619 1.0349 1.1006 1.0917 1.1003 1.1006 1.0879 1.0928 1.0977 1.0646 1.0447 1.0670 1.0660 1.1003
irintensity: 0.1161 0.7292 0.7824 2.1568 8.6096 4.1428 3.9998 10.2945 28.3594 0.2235 26.0737 1.5725 5.2010 70.8755 39.8675 7.8144 10.7145 2.7582 5.6980 6.3284 153.3977 25.1803 31.5648 187.7542 21.3499 7.8824 3.1005 0.4701 0.3219 148.8907 8.9021 9.1185 7.0635 38.9309 4.3909 12.3357 144.4497 32.7542 6.0603 47.5968 34.7847 10.1255 6.9126 32.7520 14.8979 2.9601 1.7278 18.0245 47.6795 239.5808 37.9788 20.9790 180.1442 10.4144 186.3110 47.6456 20.2893 1.6298 7.2906 10.6914 15.0446 56.2697 17.1151 4.6408 0.5034 3.9927 18.9861 8.4684 8.0143 22.5898 13.1937 26.1219 45.2007 56.5308 15.0341 12.7062 7.5109 11.0730 72.5508 144.4475 15.3632 54.3045 41.2087 45.4872 49.1672 32.6765 14.4123 10.4950 6.5003 22.5221 19.3114 5.8058 10.6649 5.2915 32.3252 3.9513 51.5867 36.3717 5.4886
temp: 298.150 k
press: 1.00000 atm
elementType: 8 8 8 8 8 7 6 6 6 6 6 6 6 6 6 6 6 6 1 1 1 1 1 1 1 1 1 1 1 1 1 1 1 1 1
symmnumber: 1
zpe: 730195.8 jmol-1
zpe.correction: 0.278117 hartree
zpe.thermalcorrener: 0.297610 hartree
zpe.thermalcorrenthalpy: 0.298554 hartree
zpe.thermalcorrgfe: 0.229805 hartree
zpe.sumelectzpe: -896.947490 hartree
zpe.sumelectthermal: -896.927997 hartree
zpe.sumelectthermalent: -896.927053 hartree
zpe.sumelectthermalfe: -896.995802 hartree
dipole: 1.4220 2.8854 -0.3106
dipole: 3.2318
quadrupole: -111.4277 -103.3853 -101.3379
quadrupole: -0.9009 2.8750 -9.3652
quadrupole: -6.0441 1.9984 4.0457 -0.9009 2.8750 -9.3652
hfenergy: -897.2256072 hartree
pointgroup: C01 [X(C12H17N1O5)]
dipole: 0.4350372 -1.1939928 -0.0419677 debye
polarizability: 136.6856148|15.0166163|164.3346559|3.0684752|-1.4639871|145.4120842 unknown
InChI: InChI=1S/C12H17NO5/c1-7(14)11(16)18-12(17)10(13)6-8-3-2-4-9(15)5-8/h2-5,7,10-11,14-16H,6,13H2,1H3
charge 0 multiplicity 1
35 atoms
O  -1.438285 -0.053235 0.540612
O  -3.049703 1.151599 -0.837044
O  -0.296558 2.480204 1.285391
O  -1.792694 -1.297201 -1.394561
O  2.478064 1.412879 -2.493615
N  -1.44552 -3.613666 0.442394
C  -0.73853 -2.347354 0.614265
C  0.733826 -2.513156 0.091336
C  1.499791 -1.201735 0.026323
C  -1.739841 1.190979 -0.275048
C  -1.394969 -1.227566 -0.202514
C  -1.625375 2.401956 0.665879
C  1.657725 -0.543723 -1.219981
C  1.995704 -0.581197 1.199899
C  -2.645108 2.379659 1.806413
C  2.293391 0.719286 -1.284337
C  2.619887 0.684806 1.127282
C  2.768468 1.349922 -0.110086
H  -0.689549 -1.973219 1.662044
H  1.2402 -3.227058 0.77038
H  0.661401 -2.982545 -0.905758
H  -0.953214 1.199476 -1.061065
H  -1.799727 3.290927 0.020954
H  1.277572 -1.019957 -2.134158
H  1.877216 -1.076271 2.170034
H  -2.439246 -3.620032 0.676165
H  -0.937938 -4.44508 0.748184
H  -3.670789 2.354681 1.402457
H  -2.481447 1.493318 2.440892
H  -2.51848 3.284342 2.424196
H  2.986428 1.16521 2.040349
H  3.262263 2.322808 -0.188428
H  -3.057312 0.422211 -1.516758
H  0.41741 2.202438 0.652748
H  2.146137 0.882795 -3.260642
