program: Gaussian 09
title: 000115440
version: EM64L-G09RevD.01
frameworkgroup: C1[X(C11H18N2O3)]
method: RPBEPBE
basis: SDD
operation: Freq
keyword: #p
keyword: freq=noraman
keyword: PBEPBE/SDD
title: #p freq=noraman PBEPBE/SDD
converged: YES YES NO NO
title: Mulliken charges:
elementType: O O O N N C C C C C C C C C C C H H H H H H H H H H H H H H H H H H
charge: -0.252238 -0.268568 -0.204603 -0.123718 -0.069453 -0.131333 -0.114224 -0.435851 -0.437713 -0.408854 -0.403880 0.116427 -0.607818 0.128760 -0.219745 -0.671637 0.282620 0.247854 0.218760 0.234430 0.233464 0.219153 0.226879 0.217333 0.222207 0.220756 0.220923 0.195508 0.222964 0.238140 0.228503 0.215398 0.223701 0.235856
chargesum: 0.00000
title: Mulliken charges with hydrogens summed into heavy atoms:
elementType: O O O N N C C C C C C C C C C C
charge: -0.252238 -0.268568 -0.204603 -0.123718 -0.069453 0.151287 0.133630 0.017340 0.014904 0.035357 0.039083 0.116427 0.031576 0.128760 0.246898 0.003318
polarizability: 1.56219977e+02 1.32847654e+00 1.39314961e+02 -1.36520343e+00 4.55357402e+00 1.19948214e+02
1716.lowfreq: -14.1056 -9.0579 -0.0003 -0.0001 0.0004 5.9617 19.8657 35.5629 48.8605
frequency: 16.9351 35.5288 48.6891 51.7908 82.5461 128.8250 140.3131 149.9488 166.4741 218.7003 231.8244 255.2957 275.5269 307.4152 326.2467 338.0769 350.8640 360.3601 371.6910 440.8348 488.8574 529.1050 611.5469 657.7613 724.3025 741.3194 755.5081 771.2812 794.6024 798.8273 816.6302 847.6754 854.2385 904.8794 920.8040 935.2096 980.7577 987.8382 1017.0995 1024.8609 1040.8141 1073.4192 1079.6937 1106.8130 1115.8570 1117.1620 1121.9850 1132.3272 1152.9559 1168.0981 1194.7823 1208.1226 1212.5838 1244.5202 1246.8745 1269.7657 1275.3962 1294.8189 1306.1958 1312.4017 1319.5383 1340.5296 1351.4083 1363.2255 1399.8295 1414.4354 1432.0512 1450.5052 1460.9048 1462.9073 1463.6807 1469.4958 1474.0595 1479.1648 1483.6314 1485.7665 1587.1365 1634.2627 2863.7643 2869.6941 2882.3330 2995.4804 3012.5046 3015.8681 3016.0421 3017.8995 3023.5693 3030.4971 3071.5427 3073.7998 3075.2990 3081.8574 3089.6244 3092.0783 3103.4908 3107.6870
redmass: 3.4539 3.7976 4.1966 5.6168 2.7528 3.1999 3.3665 2.0467 2.5864 1.2474 1.8173 1.8274 5.4629 3.2997 4.1268 2.1563 2.6791 3.0367 4.1678 4.2196 3.8529 4.3770 3.1369 6.9195 8.0173 5.8183 4.8105 6.1129 1.5329 1.1143 4.0387 3.0779 2.6115 2.8313 4.1370 1.7350 1.8205 2.5176 2.3089 2.3315 1.9067 1.5357 1.8515 3.2792 2.5045 1.3712 2.2476 1.4545 2.6385 1.2120 1.2657 2.0856 1.7374 1.4568 1.1434 1.4759 1.4613 1.4637 1.6439 1.6952 1.5834 1.3647 1.3666 1.4114 1.2703 4.1598 1.1629 1.0839 1.0582 1.0710 1.0465 1.0992 1.0609 1.1017 1.0548 1.0684 12.4869 12.1372 1.0582 1.0698 1.0665 1.0358 1.0582 1.0735 1.0672 1.0829 1.0900 1.0630 1.1064 1.1009 1.0905 1.0995 1.0897 1.0986 1.1048 1.1029
irintensity: 0.6072 0.0148 0.8148 2.8595 0.8211 1.8871 1.4694 0.9932 1.2043 0.6303 3.1050 1.6401 6.3915 15.4605 15.9413 0.5123 2.8104 1.9037 1.0617 3.9010 0.1771 3.0333 2.6515 16.3546 16.8410 6.3629 3.1592 9.1320 6.7561 3.1793 0.2295 15.6203 6.0069 4.9466 29.0851 0.1610 8.9423 36.0431 74.7938 36.9075 7.6515 4.3187 12.0202 152.1225 115.7498 4.4735 29.9079 6.2046 28.7693 19.1782 7.3694 1.8481 16.7995 18.4896 0.1267 14.7048 3.4454 2.3382 2.8212 14.3630 3.2807 0.3603 2.8002 1.1730 27.6216 96.1644 4.9007 3.7499 26.6030 4.4948 8.3503 16.8429 5.0291 9.3699 11.9784 10.3828 438.0336 185.2636 68.8699 56.4526 154.1579 18.1074 18.9321 24.4018 18.8531 58.2438 30.0339 58.8001 4.4444 25.1258 33.9279 1.6034 8.7623 31.7699 41.4327 41.2558
temp: 298.150 k
press: 1.00000 atm
elementType: 8 8 8 7 7 6 6 6 6 6 6 6 6 6 6 6 1 1 1 1 1 1 1 1 1 1 1 1 1 1 1 1 1 1
symmnumber: 1
zpe: 745459.8 jmol-1
zpe.correction: 0.283931 hartree
zpe.thermalcorrener: 0.300291 hartree
zpe.thermalcorrenthalpy: 0.301236 hartree
zpe.thermalcorrgfe: 0.238187 hartree
zpe.sumelectzpe: -763.877881 hartree
zpe.sumelectthermal: -763.861520 hartree
zpe.sumelectthermalent: -763.860576 hartree
zpe.sumelectthermalfe: -763.923624 hartree
dipole: 1.8682 5.1383 2.2674
dipole: 5.9189
quadrupole: -87.1195 -101.3293 -98.1776
quadrupole: -12.6100 -3.6729 -4.1418
quadrupole: 8.4226 -5.7871 -2.6355 -12.6100 -3.6729 -4.1418
hfenergy: -764.1618113 hartree
pointgroup: C01 [X(C11H18N2O3)]
dipole: -0.7264588 1.9797616 -0.9876819 debye
polarizability: 156.0067188|-1.9918446|138.7660374|-2.6512743|-5.5918903|120.7103961 unknown
InChI: InChI=1S/C11H18N2O3/c1-3-16-11(15)10(14)13-8-4-5-9(13)7-12(2)6-8/h8-9H,3-7H2,1-2H3
charge 0 multiplicity 1
34 atoms
O  0.712725 -1.909455 1.842003
O  2.307764 0.392477 0.090175
O  2.770667 -1.827484 -0.478111
N  -0.450955 -0.834698 0.123829
N  -2.272081 1.377121 0.150056
C  -1.826251 -1.012886 0.659824
C  -0.629924 -0.007134 -1.097751
C  -2.625828 -1.387091 -0.62265
C  -1.82734 -0.719567 -1.795822
C  -2.262491 0.360941 1.232842
C  -1.005773 1.421292 -0.622142
C  0.687295 -1.266773 0.746758
C  -2.715785 2.704568 0.607027
C  2.011538 -0.971415 0.021459
C  3.659697 0.800513 -0.421969
C  3.753689 2.312734 -0.253585
H  -1.826281 -1.783317 1.446314
H  0.287162 0.0209 -1.707136
H  -3.656524 -1.00095 -0.565524
H  -2.662632 -2.483731 -0.740479
H  -1.456978 -1.478634 -2.506606
H  -2.446849 0.007998 -2.345216
H  -3.284569 0.286871 1.650218
H  -1.569589 0.629405 2.069045
H  -0.148654 1.823806 -0.027041
H  -1.155635 2.082007 -1.497493
H  -2.803434 3.386094 -0.258617
H  -2.021548 3.175246 1.347614
H  -3.711526 2.621881 1.079158
H  4.421469 0.257207 0.165262
H  3.742752 0.48024 -1.476272
H  4.738766 2.66713 -0.608092
H  2.970577 2.826397 -0.837677
H  3.643147 2.598406 0.806198
