program: Gaussian 09
title: 000115309
version: EM64L-G09RevD.01
frameworkgroup: C1[X(C7H6O3S)]
method: RPBEPBE
basis: SDD
operation: Freq
keyword: #pfreq=noraman
keyword: PBEPBE/SDD
title: #p freq=noraman PBEPBE/SDD
converged: YES YES NO NO
title: Mulliken charges:
elementType: S O O O C C C C C C C H H H H H H
charge: 0.024368 -0.231601 -0.436786 -0.269469 0.373455 -0.379787 -0.248577 -0.252851 -0.281499 -0.155261 0.244539 0.282937 0.262308 0.258403 0.266731 0.152757 0.390334
chargesum: 0.00000
title: Mulliken charges with hydrogens summed into heavy atoms:
elementType: S O O O C C C C C C C
charge: 0.177126 -0.231601 -0.046452 -0.269469 0.373455 -0.117479 0.034360 0.005552 -0.281499 0.111470 0.244539
polarizability: 2.07598937e+02 -1.40541039e+01 1.13141469e+02 3.21801212e-03 -1.29557625e-02 3.96202248e+01
1716.lowfreq: -0.0017 -0.0014 0.0001 3.0761 4.4777 5.4543 66.0113 77.0414 103.7464
frequency: 66.0044 77.0349 103.7455 109.3291 213.0377 250.5241 284.0547 357.5126 377.5538 421.5994 464.2288 563.4033 584.9512 590.5164 652.2855 658.1765 709.9180 739.0640 756.6952 809.3256 867.4527 874.3830 880.3559 882.5207 899.7606 964.1981 1018.5516 1053.3865 1103.8902 1134.1451 1205.8326 1274.3376 1306.4089 1319.8931 1373.7110 1454.9143 1519.9817 1603.7917 1633.0287 2361.4629 3150.8136 3220.3139 3235.8939 3268.8614 3541.1124
redmass: 5.4024 9.6143 7.2589 6.4297 7.9402 7.9911 5.9221 7.6239 1.1221 10.5803 2.6320 1.2622 2.8858 4.5901 6.0985 4.0297 6.8792 1.2672 5.4344 1.3425 2.8378 2.0693 3.4244 1.3428 1.4541 3.8794 1.7732 2.1161 1.9364 1.6268 1.5641 6.5951 1.3588 2.7521 2.5024 5.7566 5.4294 8.1799 8.1993 1.0368 1.0888 1.0926 1.0984 1.1079 1.0644
irintensity: 0.2901 0.1379 0.5322 2.5229 3.8685 2.2651 0.5181 10.6109 15.7265 10.2021 62.1421 103.8603 14.5127 26.0842 37.6235 11.6208 30.5671 92.0671 10.6192 22.7438 19.4099 5.7229 4.8076 5.2883 22.2507 158.1334 53.9676 84.1254 283.4698 17.4108 6.5455 15.2385 4.0058 108.4751 25.3004 11.8106 22.3605 511.6355 57.4459 17.4978 2.8530 4.0607 0.9718 0.0127 72.1109
temp: 298.150 k
press: 1.00000 atm
elementType: 16 8 8 8 6 6 6 6 6 6 6 1 1 1 1 1 1
symmnumber: 1
zpe: 298695.3 jmol-1
zpe.correction: 0.113767 hartree
zpe.thermalcorrener: 0.123989 hartree
zpe.thermalcorrenthalpy: 0.124933 hartree
zpe.thermalcorrgfe: 0.077106 hartree
zpe.sumelectzpe: -893.244627 hartree
zpe.sumelectthermal: -893.234405 hartree
zpe.sumelectthermalent: -893.233460 hartree
zpe.sumelectthermalfe: -893.281287 hartree
dipole: 2.2696 -2.3810 0.0018
dipole: 3.2895
quadrupole: -59.4458 -63.4850 -74.6221
quadrupole: 5.0083 0.0104 -0.0076
quadrupole: 6.4051 2.3660 -8.7711 5.0083 0.0104 -0.0076
hfenergy: -893.3583937 hartree
pointgroup: C01 [X(C7H6O3S1)]
dipole: -0.8532837 0.9713163 0.0577018 debye
dipolederiv: 0.1605298 -0.059396 -0.0065287 0.4397447 -0.4404695 -0.0213681 0.0159816 -0.0139021 -0.1158317 -0.1558255 0.1293806 0.0068004 0.1862396 -0.4673457 -0.0194666 0.0088481 -0.0185391 -0.1181506 -0.4736688 -0.2600098 -0.0103961 -0.7673097 -1.1456731 -0.0206237 -0.0326432 -0.0282261 -0.4171961 -1.3700816 0.2689557 0.0272596 0.1843827 -0.7329231 -0.0204043 0.0234339 -0.0215958 -0.3350972 -0.429841 -0.1678369 -0.0002915 0.0528849 0.2656815 0.0095505 0.0106899 0.0124916 0.0528425 0.3219716 0.0978895 -0.0035818 0.1043105 -0.0281671 0.006474 -0.0032226 0.0064549 -0.2047244 0.8369702 0.0806324 -0.0100473 -0.0815412 -0.2561571 -0.0071808 -0.017377 -0.0094324 -0.0735382 -0.0589104 -0.0237183 -0.0035873 -0.4216939 -0.0977745 0.011239 -0.022711 0.0054505 -0.201686 -1.4883164 -0.1624676 0.012885 -0.4023709 0.7315287 0.0457557 0.0016165 0.0419459 -0.1377802 -0.3039538 -0.0296877 0.0011507 -0.0185973 0.2480689 0.0170704 0.0025039 0.0172067 -0.1058844 2.4254184 -0.0407276 -0.0342036 0.6153877 1.2372347 0.0336243 -0.0045007 0.0435585 0.2579366 0.0916212 0.0485168 0.0034829 -0.0263277 0.0246365 -0.0065688 -0.0001803 -0.0076654 0.1767958 0.122863 -0.0446754 -0.0007684 -0.0290912 -0.0064766 -0.0092602 -0.0000526 -0.008951 0.2032245 -0.0406986 0.0418221 0.0058515 0.0448144 0.1225866 -0.0044626 0.0060465 -0.0044084 0.2019387 0.0820783 -0.0169211 0.001353 -0.0287541 0.0359773 -0.0081276 0.0009235 -0.0083627 0.2177975 0.1002095 0.1205613 0.0067001 -0.0016892 0.1706949 -0.0010968 0.0011372 -0.0027596 0.1942278 0.1796341 0.0176821 0.0039215 0.1496107 0.3385776 -0.0051546 0.0095061 -0.0032655 0.4051255 unknown
polarizability: 206.2365374|-17.7786552|114.2861375|-3.3190373|3.6757476|39.8379552 unknown
InChI: InChI=1S/C7H6O3S/c8-7(9)6(11)4-5-2-1-3-10-5/h1-4,8,11H
charge 0 multiplicity 1
17 atoms
S  1.049269 -2.095464 -0.085991
O  -1.690833 -0.935548 0.005689
O  2.796477 1.57819 0.052818
O  3.688081 -0.560674 -0.054625
C  -1.182794 0.3892 0.059806
C  -2.264963 1.279401 0.118405
C  0.228479 0.622032 0.049433
C  -3.471775 0.498882 0.101292
C  1.265447 -0.28869 -0.007163
C  -3.087281 -0.834861 0.032554
C  2.669108 0.181724 -0.006962
H  0.516853 1.678105 0.09308
H  -2.187168 2.364022 0.167213
H  -4.493641 0.870704 0.135335
H  -3.626538 -1.77736 -0.003359
H  2.424872 -2.317165 -0.11551
H  3.764907 1.802102 0.049084
