program: Gaussian 09
title: 000115303
version: EM64L-G09RevD.01
frameworkgroup: C1[X(C14H18N2O7)]
method: RPBEPBE
basis: SDD
operation: Freq
keyword: #p
keyword: freq=noraman
keyword: PBEPBE/SDD
title: #p freq=noraman PBEPBE/SDD
converged: YES YES NO NO
title: Mulliken charges:
elementType: O O O O O O O N N C C C C C C C C C C C C C C H H H H H H H H H H H H H H H H H H
charge: -0.291296 -0.426640 -0.216185 -0.415774 -0.409798 -0.404183 -0.233153 -0.389272 -0.599021 -0.146519 -0.574570 -0.402415 -0.530015 -0.149183 0.606496 0.285346 0.149417 -0.595327 -0.401051 0.171627 0.192210 -0.391342 0.151890 0.291595 0.260325 0.211247 0.251258 0.226076 0.238894 0.223964 0.312120 0.238817 0.221683 0.267887 0.272467 0.302481 0.224531 0.389985 0.377908 0.352737 0.354781
chargesum: 0.00000
title: Mulliken charges with hydrogens summed into heavy atoms:
elementType: O O O O O O O N N C C C C C C C C C C C C C C
charge: -0.291296 -0.036655 -0.216185 -0.037866 -0.057061 -0.049402 -0.233153 -0.077152 -0.024073 0.145076 -0.102998 0.074919 -0.067157 0.089634 0.606496 0.285346 0.149417 -0.373643 -0.133164 0.171627 0.192210 -0.166811 0.151890
polarizability: 1.69052147e+02 -4.44936366e+00 2.25437390e+02 -1.37550007e+01 9.38870491e+00 1.72549490e+02
1716.lowfreq: -10.0231 -3.3368 -2.6195 -0.0009 -0.0009 0.0000 5.4521 9.8209 21.6863
frequency: -8.0479 9.5217 21.6803 27.7476 34.0126 38.5785 49.1727 71.2042 79.3438 98.4435 126.3595 128.8229 163.8930 177.9104 185.6386 212.2191 237.9231 250.2274 283.2094 290.4291 292.2321 298.8553 326.3548 339.1051 342.6966 363.0727 383.5432 410.2310 434.3469 440.9100 481.8984 515.6686 543.9538 548.3847 555.4437 559.0618 579.0414 593.0066 603.9138 607.4760 615.2891 618.5663 686.2172 690.3887 712.3722 715.2733 740.7991 765.8864 768.1736 793.8494 818.7010 830.7918 865.2764 885.6046 919.9073 928.5056 947.3327 983.4274 1029.9759 1035.7560 1050.3867 1052.5829 1072.9239 1080.3976 1114.6626 1123.7221 1139.6470 1145.3047 1169.9481 1177.3809 1184.7341 1201.7873 1232.8807 1256.3050 1257.1729 1262.9392 1274.0101 1291.7829 1296.2747 1306.7180 1314.0416 1317.8249 1322.5997 1339.3646 1354.7771 1396.3107 1404.1495 1427.9475 1440.7526 1458.6387 1466.9580 1483.9249 1523.9058 1607.5570 1609.7834 1612.3665 1633.2338 1664.9953 1672.6476 2973.8073 2982.9014 2992.6397 3005.4773 3022.1406 3041.8611 3043.4842 3067.8957 3096.1224 3115.8331 3155.9228 3474.5669 3503.4108 3520.5250 3560.3381 3574.1090 3577.2395 3612.2921
redmass: 5.5553 8.3060 8.9537 5.5338 5.8628 4.8633 7.2948 7.8241 6.0173 3.9640 5.7774 4.8841 3.3100 3.4376 6.1424 5.2316 2.0509 1.7502 4.1442 3.9727 3.3311 5.2136 2.0278 1.4724 2.0536 1.6498 3.8188 3.3952 4.7197 3.1358 3.9041 3.7804 2.5488 2.2082 2.1050 3.0830 2.3832 3.0082 1.7947 1.3407 3.4008 2.7592 3.3189 4.0924 2.7284 3.5110 5.6048 4.9189 2.7613 1.4213 1.8242 1.5305 5.0621 2.0539 3.3583 1.7201 3.5341 2.4376 2.7311 2.9612 3.1196 3.2666 2.5424 2.2722 1.8822 2.0609 1.3856 1.5094 1.5026 1.7019 1.2702 1.3293 1.5972 1.9335 1.3363 1.5402 1.6459 2.9094 1.3548 1.5155 1.3923 1.4221 1.3198 1.4186 1.6510 1.7988 5.0028 2.9894 1.0916 1.1625 1.0971 1.8946 2.9819 6.4649 5.9750 1.3069 6.0470 9.2153 3.7267 1.0592 1.0619 1.0620 1.0817 1.0975 1.0989 1.0863 1.1037 1.0908 1.0894 1.0950 1.0449 1.0638 1.0642 1.0776 1.0658 1.0662 1.0991
irintensity: 0.2189 0.1459 2.2519 0.4409 1.1414 1.3005 0.5126 9.6226 1.9126 2.3867 2.1340 4.4244 2.3849 11.9610 6.9197 1.3577 29.8436 28.3631 2.1298 7.4979 2.6127 20.3266 56.1422 0.0716 34.2841 189.1981 5.5803 11.3118 1.2483 7.2842 12.8733 63.4391 74.9340 29.8360 119.1451 21.3904 68.9879 104.9133 197.9506 147.1575 5.4695 33.9471 49.0013 45.8645 34.5894 0.0843 1.9868 6.1402 10.9360 61.0673 6.4570 7.1436 41.9506 18.8195 15.9715 5.7547 29.5258 8.0299 12.9822 12.0419 151.8763 69.5209 129.6302 236.2344 14.8313 6.1545 414.1396 35.8159 8.0649 19.0605 0.8927 3.4848 63.1291 10.1684 5.8274 28.3807 48.1193 25.8150 2.5879 48.4883 4.2066 4.8170 13.7589 16.9362 40.4734 5.2953 1.8391 26.2114 13.5459 64.5474 16.2675 227.7007 102.3448 72.3154 66.9973 153.5105 8.8411 276.1191 118.1009 24.4265 5.1690 8.3845 34.9495 10.1650 4.7608 15.1913 32.2713 17.9005 14.7342 1.2070 9.2372 21.3333 35.5550 25.6628 34.3018 40.1574 10.4223
temp: 298.150 k
press: 1.00000 atm
elementType: 8 8 8 8 8 8 8 7 7 6 6 6 6 6 6 6 6 6 6 6 6 6 6 1 1 1 1 1 1 1 1 1 1 1 1 1 1 1 1 1 1
symmnumber: 1
zpe: 826150.2 jmol-1
zpe.correction: 0.314664 hartree
zpe.thermalcorrener: 0.338101 hartree
zpe.thermalcorrenthalpy: 0.339046 hartree
zpe.thermalcorrgfe: 0.257971 hartree
zpe.sumelectzpe: -1178.633525 hartree
zpe.sumelectthermal: -1178.610087 hartree
zpe.sumelectthermalent: -1178.609143 hartree
zpe.sumelectthermalfe: -1178.690218 hartree
dipole: -0.0174 2.6067 3.1940
dipole: 4.1228
quadrupole: -151.8008 -142.0247 -120.4331
quadrupole: 4.7971 -5.3084 24.3295
quadrupole: -13.7146 -3.9385 17.6531 4.7971 -5.3084 24.3295
hfenergy: -1178.9481886 hartree
pointgroup: C01 [X(C14H18N2O7)]
dipole: -0.1111141 0.8342626 1.3865928 debye
polarizability: 170.8959392|-14.374904|217.6549374|-17.262465|12.6863373|178.4881513 unknown
InChI: InChI=1S/C14H18N2O7/c15-8(13(20)21)2-4-12(19)16-9(14(22)23)5-7-1-3-10(17)11(18)6-7/h1,3,6,8-9,16-18,20,22H,2,4-5,15H2
charge 0 multiplicity 1
41 atoms
O  0.118444 1.591151 -1.784091
O  -1.577228 3.781716 1.751081
O  -3.495818 3.760119 0.439939
O  4.738065 1.447641 1.318113
O  -2.583896 -4.174559 1.600269
O  -1.727225 -4.654805 -0.923989
O  5.198466 -0.779436 0.856531
N  -0.445893 1.729489 0.468512
N  4.993503 -0.215027 -1.871316
C  -1.874016 1.911093 0.215562
C  -2.768412 0.765416 0.792736
C  2.720509 0.507451 -0.986197
C  1.939668 1.531096 -0.130965
C  4.280738 0.660214 -0.933302
C  -2.417116 -0.634973 0.304106
C  0.473469 1.613031 -0.563417
C  -2.411659 3.234629 0.763901
C  -2.620407 -1.734022 1.178413
C  -1.96139 -0.897546 -1.008833
C  4.794089 0.337759 0.466107
C  -2.391554 -3.06388 0.764963
C  -1.726657 -2.225964 -1.42899
C  -1.940636 -3.317162 -0.560028
H  -1.989732 1.947035 -0.883344
H  -3.813737 1.01401 0.520728
H  -2.716524 0.79567 1.899312
H  2.415519 0.650986 -2.040103
H  2.446516 -0.527547 -0.704724
H  2.385787 2.536223 -0.275828
H  2.024441 1.30395 0.947172
H  -0.11305 1.803589 1.431007
H  4.522054 1.720206 -1.141664
H  -2.970151 -1.550821 2.204761
H  -1.759005 -0.08077 -1.708413
H  4.628645 -0.203897 -2.826037
H  5.182339 -1.152374 -1.503742
H  -1.368206 -2.413759 -2.449697
H  -1.983406 4.62268 2.095736
H  5.067276 1.182754 2.220545
H  -2.904938 -3.88296 2.489996
H  -1.419773 -4.706606 -1.863412
