program: Gaussian 09
title: 000115176
version: EM64L-G09RevD.01
frameworkgroup: C1[X(C12H16N4O2)]
method: RPBEPBE
basis: SDD
operation: Freq
keyword: #p
keyword: freq=noraman
keyword: PBEPBE/SDD
title: #p freq=noraman PBEPBE/SDD
converged: YES YES NO NO
title: Mulliken charges:
elementType: O O N N N N C C C C C C C C C C C C H H H H H H H H H H H H H H H H
charge: -0.342550 -0.318366 -0.168867 -0.410954 -0.438274 -0.492560 -0.360487 -0.375951 -0.370735 0.300433 -0.328513 0.270549 0.472373 -0.450144 -0.349614 -0.198986 -0.214758 -0.265568 0.234998 0.236551 0.249176 0.204727 0.235266 0.233222 0.255831 0.213343 0.330623 0.361826 0.302145 0.215433 0.307318 0.219783 0.219889 0.222839
chargesum: 0.00000
title: Mulliken charges with hydrogens summed into heavy atoms:
elementType: O O N N N N C C C C C C C C C C C C
charge: -0.342550 -0.318366 -0.168867 -0.080331 -0.076448 -0.190415 0.111063 0.077952 0.097753 0.300433 0.140661 0.270549 0.472373 -0.234710 -0.042296 0.020797 0.005131 -0.042728
polarizability: 2.57392662e+02 1.03142716e+01 1.61813435e+02 7.12629026e+00 1.32476934e+00 8.52312278e+01
1716.lowfreq: -7.0008 -1.3769 -0.0007 -0.0006 -0.0004 7.3342 11.3147 34.2812 44.9740
frequency: 9.7341 34.2788 44.9119 51.4819 84.4539 91.9302 116.0410 130.8377 136.2672 194.9619 223.1105 237.1259 263.1428 287.8934 335.6977 376.9563 408.6308 433.1764 456.6541 473.2774 500.1312 559.1790 594.9824 615.3466 621.3601 689.3928 695.9994 704.6456 708.8262 723.3765 750.3651 763.6033 785.4546 819.4367 839.3009 871.5910 882.6846 910.0953 934.3202 959.2210 966.3483 982.5676 996.5132 1000.7945 1026.4302 1051.0873 1065.7361 1087.7315 1100.4762 1113.7557 1144.9186 1169.3771 1179.6600 1186.8521 1194.7824 1220.8545 1243.5557 1255.4316 1277.2683 1284.2371 1301.7017 1316.2388 1320.1592 1343.4951 1353.7688 1384.9668 1387.5028 1424.6263 1428.5643 1460.0758 1477.3400 1486.8267 1498.7928 1503.2581 1513.4091 1531.8988 1596.0743 1618.1763 1644.0799 1658.0256 2952.8551 2963.4764 2972.3452 2997.4715 3043.2093 3046.5793 3061.3460 3066.8576 3105.6211 3126.3687 3138.3168 3161.0451 3191.5631 3283.3532 3521.2629 3628.3526
redmass: 4.5703 4.6145 4.9416 4.7914 6.4575 4.5850 2.2206 4.3808 3.4211 4.7463 5.3620 3.7978 6.3021 2.9640 6.1606 3.5408 2.9630 1.0930 2.5492 4.1787 2.1740 1.4150 5.8606 6.3864 3.7112 5.2235 1.9772 7.2268 10.9156 4.6039 3.2556 1.7070 1.1738 4.3775 1.2751 2.2336 1.6662 1.4346 2.9395 2.4306 1.3401 5.9793 1.2959 3.5957 2.1627 2.3556 2.4108 1.5799 1.8080 2.6950 3.3046 1.0505 1.5194 1.1127 1.1876 1.2746 1.5657 1.8678 2.4294 2.1655 1.4706 1.4787 1.4706 1.3422 1.3067 4.5608 1.7527 1.7814 2.5048 1.2569 1.0951 2.3167 1.1718 1.1267 2.3954 1.6816 6.1155 5.6837 4.1161 4.2266 1.0681 1.0669 1.0672 1.0616 1.0954 1.0941 1.1014 1.1017 1.0879 1.0865 1.0934 1.0998 1.0948 1.0844 1.0762 1.0799
irintensity: 1.0180 1.1042 3.6247 1.3874 10.1453 0.6310 7.4612 3.9845 6.1476 8.5319 11.2290 2.9221 6.7880 10.5782 0.8174 11.7307 0.0157 141.9625 11.9923 20.2346 28.2315 3.5970 3.6667 1.7024 4.8657 12.3904 29.0565 4.6084 30.7311 7.5708 13.5103 85.5040 181.0637 0.5979 1.7446 6.9923 9.5350 15.9853 5.8727 0.8083 0.0221 1.2262 3.8253 38.8074 13.6400 12.8115 13.6245 13.1082 6.5816 10.0453 2.4638 0.6626 56.9462 5.4298 39.0934 56.0008 98.4006 197.5588 9.6530 149.3876 55.1411 0.5379 113.5829 14.7477 7.1106 67.6528 35.9616 102.1076 79.4274 63.8492 11.1834 101.7217 119.3033 32.7980 481.7201 903.6115 46.8318 68.9527 109.8036 284.9706 53.9911 73.4922 79.7359 30.3375 31.9504 14.6870 47.0241 28.7761 17.7128 0.8084 38.6444 30.7157 11.2665 685.6883 13.1998 60.0246
temp: 298.150 k
press: 1.00000 atm
elementType: 8 8 7 7 7 7 6 6 6 6 6 6 6 6 6 6 6 6 1 1 1 1 1 1 1 1 1 1 1 1 1 1 1 1
symmnumber: 1
zpe: 725997.2 jmol-1
zpe.correction: 0.276518 hartree
zpe.thermalcorrener: 0.293378 hartree
zpe.thermalcorrenthalpy: 0.294322 hartree
zpe.thermalcorrgfe: 0.228789 hartree
zpe.sumelectzpe: -835.038258 hartree
zpe.sumelectthermal: -835.021398 hartree
zpe.sumelectthermalent: -835.020454 hartree
zpe.sumelectthermalfe: -835.085987 hartree
dipole: -9.0019 1.6664 0.0163
dipole: 9.1548
quadrupole: -68.4827 -103.5444 -110.3870
quadrupole: 5.9061 2.5734 -2.6349
quadrupole: 25.6554 -9.4064 -16.2490 5.9061 2.5734 -2.6349
hfenergy: -835.3147759 hartree
pointgroup: C01 [X(C12H16N4O2)]
dipole: -3.5011992 -0.8172505 0.2158573 debye
polarizability: 257.5959641|-6.9211677|159.8946424|-11.6848362|-9.1157511|86.9467186 unknown
InChI: InChI=1S/C12H16N4O2/c17-11(15-10-4-2-1-3-5-10)13-6-8-16-9-7-14-12(16)18/h1-5,13-15H,6-9H2
charge 0 multiplicity 1
34 atoms
O  -2.1996 -1.714578 0.163996
O  1.113412 2.166164 0.012188
N  -3.738464 0.093047 -0.090284
N  -4.471628 -1.809864 0.853499
N  -0.586318 0.568031 0.207484
N  1.629066 -0.144239 0.162038
C  -5.111255 0.405711 0.364295
C  -2.84096 1.082705 -0.716646
C  -5.695542 -1.002748 0.713281
C  -3.355952 -1.193335 0.289981
C  -1.660815 1.561721 0.164814
C  0.7445 0.953152 0.120075
C  3.044866 -0.133014 0.08336
C  3.711592 -1.389853 0.138979
C  3.812823 1.057499 -0.045669
C  5.117299 -1.457814 0.066779
C  5.219715 0.969927 -0.117172
C  5.885199 -0.276723 -0.062548
H  -5.694792 0.90381 -0.429765
H  -5.095988 1.067164 1.254311
H  -2.431092 0.664075 -1.655915
H  -3.467709 1.953015 -0.982108
H  -6.284912 -0.978645 1.645561
H  -6.342302 -1.380881 -0.103629
H  -1.230536 2.491376 -0.251324
H  -2.036641 1.800628 1.182469
H  -4.448466 -2.793084 1.111103
H  -0.891986 -0.421821 0.227805
H  1.202963 -1.068745 0.261411
H  3.125205 -2.313176 0.238248
H  3.296023 2.017987 -0.086788
H  5.611872 -2.434955 0.111537
H  5.801512 1.893846 -0.216671
H  6.977806 -0.328484 -0.118997
