program: Gaussian 09
title: 000115171
version: EM64L-G09RevD.01
frameworkgroup: C1[X(C14H12ClNO2)]
method: RPBEPBE
basis: SDD
operation: Freq
keyword: #p
keyword: freq=noraman
keyword: PBEPBE/SDD
title: #p freq=noraman PBEPBE/SDD
converged: NO YES NO NO
title: Mulliken charges:
elementType: Cl O O N C C C C C C C C C C C C C C H H H H H H H H H H H H
charge: -0.058816 -0.183225 -0.183223 -0.354707 0.136099 0.136105 -0.493833 -0.493835 -0.415763 -0.415762 0.061894 0.061893 0.495904 -0.339384 -0.339389 -0.210212 -0.210211 -0.113644 0.238158 0.252407 0.238159 0.252406 0.219583 0.213550 0.219583 0.213550 0.280028 0.280028 0.256328 0.256328
chargesum: 0.00000
title: Mulliken charges with hydrogens summed into heavy atoms:
elementType: Cl O O N C C C C C C C C C C C C C C
charge: -0.058816 -0.183225 -0.183223 -0.354707 0.136099 0.136105 -0.003268 -0.003270 0.017370 0.017370 0.061894 0.061893 0.495904 -0.059356 -0.059361 0.046117 0.046117 -0.113644
polarizability: 2.61436008e+02 -6.30016734e-05 1.70915669e+02 -2.90389102e-04 -7.63438008e+00 8.90497686e+01
1716.lowfreq: -2.5469 -0.0016 -0.0015 0.0010 5.3169 8.8077 35.6488 37.7505 68.1558
frequency: 35.6245 37.3779 68.1554 102.7963 113.7475 127.3122 177.7379 218.5892 223.2546 248.6833 275.0803 277.6473 332.9016 337.2587 390.7215 406.7619 419.2436 442.3767 451.7319 504.1027 520.6574 544.4588 621.3845 623.4816 676.4072 697.6430 703.9800 735.8154 737.1764 790.9131 814.6668 818.8261 824.8309 856.4245 863.3023 897.2790 941.9609 954.5024 956.6071 996.6660 1018.9809 1047.4611 1077.0009 1078.2425 1078.8800 1097.8587 1124.2226 1124.2758 1166.0425 1194.7062 1228.0333 1229.8070 1230.9651 1266.8910 1302.3731 1331.2218 1338.9148 1341.5645 1353.4996 1370.0748 1385.9496 1405.2906 1446.9757 1451.9372 1471.3369 1472.8067 1484.3584 1582.6909 1602.5549 1613.9079 1666.1714 1678.6786 2973.2710 2973.4075 2989.1064 2992.2198 3031.6119 3033.1563 3055.4779 3062.0241 3166.5523 3167.1897 3195.2514 3197.9944
redmass: 6.9159 3.9469 7.3180 3.2860 3.6899 8.0819 7.0188 8.7342 6.1481 4.2332 4.7000 1.9145 6.0769 5.6587 5.5852 2.9329 4.6226 4.9863 2.9868 2.9400 6.9900 2.8943 8.0521 7.0019 6.4327 3.8527 5.9259 4.9767 4.2542 5.2267 1.2575 1.7189 1.6068 2.4681 2.9026 1.5440 1.3997 2.4989 1.3690 4.5917 6.8810 4.3029 2.5018 4.0239 1.9819 1.8532 1.1612 1.3344 1.4631 1.1288 2.0049 1.6254 1.8540 1.2687 1.2774 1.3431 1.4852 7.0027 1.6536 7.8655 3.1455 3.1860 1.1087 1.0738 1.0900 1.0881 2.4990 7.7771 6.0754 12.3924 12.5395 8.6130 1.0653 1.0655 1.0662 1.0610 1.0928 1.0939 1.0983 1.1040 1.0909 1.0906 1.0948 1.0961
irintensity: 0.7562 0.4164 0.9720 1.2644 0.1064 4.8218 1.7945 0.0045 0.1466 1.0434 1.6520 1.2787 10.5136 0.1431 0.5508 0.0416 16.8620 11.4395 3.9794 28.6550 8.7745 1.2315 1.7275 0.6460 2.1204 0.5388 14.1641 4.8594 10.1793 39.2310 0.8780 3.6646 70.2912 0.1351 18.1872 2.7129 6.1697 10.9335 0.0119 35.7543 39.5795 6.6165 41.5986 1.3445 1.9333 2.9301 1.4681 21.2267 18.7562 0.1487 18.3824 7.1680 33.9877 6.8019 2.7364 0.1890 3.6309 482.1440 0.9514 0.9861 2.6239 13.7051 0.7101 36.4596 12.1771 8.9612 294.0563 26.9941 4.0340 388.1867 8.6640 44.2797 17.6000 0.2492 30.2140 30.9214 25.1430 2.3498 56.7576 46.2075 2.3340 2.2723 0.4228 0.0531
temp: 298.150 k
press: 1.00000 atm
elementType: 17 8 8 7 6 6 6 6 6 6 6 6 6 6 6 6 6 6 1 1 1 1 1 1 1 1 1 1 1 1
symmnumber: 1
zpe: 597349.4 jmol-1
zpe.correction: 0.227518 hartree
zpe.thermalcorrener: 0.242783 hartree
zpe.thermalcorrenthalpy: 0.243727 hartree
zpe.thermalcorrgfe: 0.183948 hartree
zpe.sumelectzpe: -1204.696684 hartree
zpe.sumelectthermal: -1204.681419 hartree
zpe.sumelectthermalent: -1204.680475 hartree
zpe.sumelectthermalfe: -1204.740254 hartree
dipole: 5.4543 -0.0001 0.0000
dipole: 5.4543
quadrupole: -101.4050 -117.2706 -110.2762
quadrupole: -0.0001 0.0004 -5.7475
quadrupole: 8.2456 -7.6200 -0.6256 -0.0001 0.0004 -5.7475
hfenergy: -1204.9242019 hartree
pointgroup: C01 [X(C14H12Cl1N1O2)]
dipole: -2.1458969 0.0001159 -0.0001463 debye
polarizability: 261.4360069|-0.0045131|170.5016267|0.012079|9.5920932|89.4638115 unknown
InChI: InChI=1S/C14H12ClNO2/c15-9-5-7-10(8-6-9)16-13(17)11-3-1-2-4-12(11)14(16)18/h5-8H,1-4H2
charge 0 multiplicity 1
30 atoms
Cl 6.103022 -0.000239 0.000282
O  -0.415704 -2.356834 0.18399
O  -0.41547 2.356868 -0.184448
N  0.032837 -0.000006 -0.000204
C  -2.226751 -0.68046 0.052117
C  -2.226687 0.680655 -0.052803
C  -3.45716 -1.536848 0.132244
C  -3.457012 1.537156 -0.13298
C  -4.695857 -0.647293 0.427046
C  -4.695773 0.647718 -0.427849
C  -0.808989 -1.168234 0.090745
C  -0.808874 1.1683 -0.09133
C  1.468586 -0.000067 -0.000073
C  2.180682 -1.105268 -0.534548
C  2.180682 1.10509 0.534507
C  3.591026 -1.108601 -0.528864
C  3.591026 1.108318 0.529039
C  4.277768 -0.000173 0.000154
H  -3.588591 -2.08315 -0.824552
H  -3.329068 -2.319647 0.903875
H  -3.588438 2.083453 0.823819
H  -3.328818 2.319961 -0.90459
H  -5.620345 -1.223402 0.239998
H  -4.697644 -0.371981 1.500236
H  -5.62022 1.223912 -0.240856
H  -4.697527 0.372404 -1.501038
H  1.641828 -1.965639 -0.935124
H  1.64183 1.965514 0.93497
H  4.141723 -1.96108 -0.936175
H  4.141718 1.960772 0.93641
