program: Gaussian 09
title: 000115103
version: EM64L-G09RevD.01
frameworkgroup: C1[X(C11H11N5)]
method: RPBEPBE
basis: SDD
operation: Freq
keyword: #pfreq=noraman
keyword: PBEPBE/SDD
title: #p freq=noraman PBEPBE/SDD
converged: YES YES NO NO
title: Mulliken charges:
elementType: N N N N N C C C C C C C C C C C H H H H H H H H H H H
charge: -0.228268 -0.041174 0.046704 -0.014120 -0.624466 0.144957 -0.053678 0.505320 -0.058601 0.117750 0.053581 -0.590314 -0.659843 -0.847287 -0.295938 -0.299557 0.256108 0.238975 0.263701 0.240072 0.228926 0.251571 0.230865 0.318168 0.343233 0.237240 0.236076
chargesum: 0.00000
title: Mulliken charges with hydrogens summed into heavy atoms:
elementType: N N N N N C C C C C C C C C C C
charge: -0.228268 -0.041174 0.046704 -0.014120 0.036935 0.144957 -0.053678 0.505320 -0.058601 0.117750 0.053581 -0.334206 0.082904 -0.135925 -0.058698 -0.063481
polarizability: 2.54927466e+02 3.19888269e+00 1.70110791e+02 1.13524220e+00 6.44709243e-01 6.89681965e+01
1716.lowfreq: -6.3160 -0.0007 -0.0006 0.0001 5.6259 9.0485 70.5117 90.9697 110.2324
frequency: 70.5067 90.9645 110.2293 118.2116 188.2026 198.0025 214.3670 230.5341 256.8324 274.0504 317.5637 323.4307 352.3596 368.7704 403.0199 459.7675 477.4938 517.4555 543.6873 550.3982 585.0176 603.1003 633.9926 660.3239 694.1514 695.7707 734.2624 821.5833 829.7853 854.9093 885.5152 890.5380 940.4066 944.2273 1004.5470 1026.8628 1033.6127 1043.4282 1066.5636 1109.6806 1119.6872 1168.0956 1206.6464 1211.6629 1278.1917 1294.1032 1310.1337 1341.8576 1369.0648 1395.5657 1402.1751 1407.9770 1435.5549 1462.4432 1470.4618 1477.0234 1485.8928 1490.0811 1497.1750 1513.4481 1553.1782 1570.4346 1605.8708 1638.1496 2972.6807 2979.5612 3050.4961 3062.4164 3089.0918 3118.5064 3130.5938 3143.7359 3152.1234 3552.5328 3692.8764
redmass: 2.9866 3.5543 2.0856 1.7347 3.8684 4.6788 2.1488 1.1061 2.2167 2.4803 4.5418 2.1065 4.9201 3.6595 6.2855 5.1202 8.2755 1.2576 5.1743 3.7867 3.3340 7.0745 3.9525 6.1595 8.0070 7.5798 6.7180 2.4525 4.9826 1.5557 1.6361 4.3898 4.7898 1.4844 1.8669 2.4527 2.2228 1.5308 3.0533 2.6367 1.3822 1.9346 2.9511 2.8289 3.6752 3.8857 2.8783 3.7406 2.8510 1.5413 1.9632 2.6012 2.2513 2.0101 1.1822 1.0727 1.9208 1.5901 1.1152 6.7925 3.8892 4.3851 3.2408 1.9681 1.0391 1.0401 1.0964 1.0989 1.0978 1.0877 1.0958 1.0974 1.0916 1.0453 1.1030
irintensity: 2.4631 1.5408 10.7335 2.5020 6.5233 5.0663 16.9860 12.6729 35.5564 23.9751 0.4045 20.1406 14.9075 11.2150 1.2061 0.9223 10.9729 248.9047 3.3638 3.2020 0.1831 5.2511 3.4278 3.9174 10.8057 10.8298 0.2892 0.1548 2.4198 11.2827 37.3921 1.8537 6.8432 0.3343 12.4338 0.8738 14.9058 7.5646 2.1801 53.2673 3.4640 8.4116 0.9218 3.1977 38.5262 7.7781 27.4957 80.9358 2.5996 45.9390 5.3756 9.7624 20.4787 53.0091 22.0989 5.2002 16.9300 33.4860 10.0927 34.9179 163.7239 109.7309 28.2087 381.5368 25.7413 84.5547 15.6061 24.6462 19.0196 4.5116 7.4244 66.1576 4.9780 98.5780 35.7004
temp: 298.150 k
press: 1.00000 atm
elementType: 7 7 7 7 7 6 6 6 6 6 6 6 6 6 6 6 1 1 1 1 1 1 1 1 1 1 1
symmnumber: 1
zpe: 548928.1 jmol-1
zpe.correction: 0.209076 hartree
zpe.thermalcorrener: 0.222613 hartree
zpe.thermalcorrenthalpy: 0.223557 hartree
zpe.thermalcorrgfe: 0.169603 hartree
zpe.sumelectzpe: -698.408538 hartree
zpe.sumelectthermal: -698.395001 hartree
zpe.sumelectthermalent: -698.394057 hartree
zpe.sumelectthermalfe: -698.448011 hartree
dipole: 6.6930 1.9419 0.4709
dipole: 6.9850
quadrupole: -65.1749 -92.0056 -96.1090
quadrupole: 1.8579 2.5484 -1.1979
quadrupole: 19.2549 -7.5757 -11.6792 1.8579 2.5484 -1.1979
hfenergy: -698.6176142 hartree
pointgroup: C01 [X(C11H11N5)]
dipole: -2.6184581 -0.8122003 0.1898356 debye
polarizability: 254.7748122|4.719198|170.2564278|-1.8168511|0.0241933|68.9752138 unknown
InChI: InChI=1S/C11H11N5/c1-6-5-7-8(14-4-3-13-7)9-10(6)16(2)11(12)15-9/h3-5H,12H2,1-2H3
charge 0 multiplicity 1
27 atoms
N  -2.400857 -0.072748 0.002401
N  -1.087323 1.81746 0.047728
N  1.945689 1.736553 -0.011275
N  3.12438 -0.899639 -0.020615
N  -3.481746 2.117997 0.034616
C  -1.055318 -0.524394 -0.003573
C  -0.273116 0.675514 0.005398
C  -0.483643 -1.836753 0.006872
C  1.156794 0.598921 -0.006468
C  -2.342884 1.331306 0.04807
C  1.74403 -0.733881 -0.011453
C  0.916181 -1.901533 0.000849
C  -3.643148 -0.844411 -0.098145
C  -1.299511 -3.11847 0.025707
C  3.280966 1.534969 -0.022704
C  3.866965 0.227454 -0.026905
H  1.425984 -2.870249 0.008655
H  -4.389858 -0.253698 -0.658352
H  -3.470368 -1.774608 -0.655994
H  -4.057226 -1.101321 0.895454
H  -1.821064 -3.292933 -0.9354
H  -0.639903 -3.984833 0.197643
H  -2.062328 -3.116208 0.826005
H  -4.360076 1.792475 0.429256
H  -3.317291 3.121855 -0.003006
H  3.915386 2.428878 -0.028473
H  4.956186 0.104697 -0.035094
