program: Gaussian 09
title: 000115033
version: EM64L-G09RevD.01
frameworkgroup: C1[X(C15H11NO3)]
method: RPBEPBE
basis: SDD
operation: Freq
keyword: #p
keyword: freq=noraman
keyword: PBEPBE/SDD
title: #p freq=noraman PBEPBE/SDD
converged: YES YES NO NO
title: Mulliken charges:
elementType: O O O N C C C C C C C C C C C C C C C H H H H H H H H H H H
charge: -0.413475 -0.306983 -0.438097 -0.400477 0.164850 0.220519 0.274793 0.401158 0.010237 -0.374199 -0.030760 -0.394899 -0.540396 -0.448422 -0.274361 -0.227982 0.300120 -0.198264 -0.367045 0.335954 0.270860 0.230961 0.247563 0.264697 0.232547 0.233448 0.229688 0.254894 0.386470 0.356603
chargesum: 0.00000
title: Mulliken charges with hydrogens summed into heavy atoms:
elementType: O O O N C C C C C C C C C C C C C C C
charge: -0.027006 -0.306983 -0.081494 -0.064523 0.164850 0.220519 0.274793 0.401158 0.010237 -0.103339 -0.030760 -0.163938 -0.292833 -0.183725 -0.041814 0.005466 0.300120 0.031424 -0.112151
polarizability: 2.47815115e+02 5.54720258e+00 2.25739049e+02 -3.62740784e-01 -7.69942254e+00 9.59444823e+01
1716.lowfreq: -9.1265 -2.7319 -0.0005 0.0002 0.0004 3.1855 37.8078 64.4497 76.9415
frequency: 37.7825 64.4471 76.9406 114.5305 123.7544 193.2167 209.6384 238.6236 261.3834 291.8055 326.5667 330.3349 356.2579 367.7555 412.8376 425.1173 439.8054 451.1156 464.0504 518.3631 531.5992 559.1828 613.9242 628.6507 642.0417 661.0878 664.2278 691.3311 696.0637 702.9335 735.9727 760.7116 769.5153 782.3582 796.9047 856.4549 864.9361 882.9720 897.0096 915.9566 951.0698 972.4907 973.5787 985.4610 988.8232 1041.1017 1078.5886 1118.9351 1129.1775 1152.0975 1176.0910 1177.9789 1209.7222 1240.1259 1257.4560 1274.8668 1292.4859 1315.3315 1334.4322 1363.0530 1384.3479 1400.6729 1409.6166 1438.4664 1457.1853 1489.7478 1494.0053 1564.7826 1601.7583 1604.4309 1610.2294 1620.6849 1630.5131 3123.4158 3135.7088 3138.3695 3142.7218 3156.9353 3160.9277 3174.6667 3175.9888 3307.0350 3519.3888 3581.0239
redmass: 5.7073 5.5307 5.3784 5.8812 6.3801 6.4593 5.6601 4.3466 5.2923 4.7032 6.5896 5.9898 5.7630 1.1332 4.2587 7.4951 4.0779 4.6035 3.9697 7.1680 3.9547 4.4717 7.2904 4.5577 4.7106 6.4543 1.1012 2.3851 4.0182 2.1607 2.6145 4.6846 1.3757 5.7854 1.4842 1.6563 1.4669 5.0901 1.5844 3.4460 1.3647 2.6577 1.6272 5.6522 1.3262 2.1211 1.6749 1.8582 2.0335 1.5687 1.0905 1.0927 2.1999 1.8713 2.0826 1.7200 2.5794 1.4286 3.6748 2.7996 4.9626 5.8885 2.6793 2.9077 3.2543 2.7879 2.8103 6.5895 4.9285 5.6416 6.1972 5.6519 7.4206 1.0882 1.0868 1.0919 1.0885 1.0938 1.0941 1.0985 1.0980 1.0630 1.0767 1.0660
irintensity: 0.7669 0.1855 0.5841 0.1197 0.6335 0.5128 0.6946 0.4391 0.7859 8.4697 3.2346 24.2069 1.6196 137.2617 12.7413 1.3369 10.4847 4.5473 2.6276 4.2723 10.1738 2.6221 9.1804 8.7433 2.1292 5.6685 92.3042 31.5694 7.9251 6.0161 23.4295 14.0640 152.5353 27.9993 39.4217 28.5587 2.4252 10.3365 9.1526 37.9394 2.5545 2.1264 1.6964 5.9216 0.3315 2.3199 19.0168 49.0146 99.3670 116.1274 4.5219 0.7905 66.7553 54.4711 13.7927 217.4978 81.7581 24.2644 11.1281 57.2721 6.4372 65.2436 16.0050 55.2990 0.3929 43.7180 15.7607 74.1633 166.6593 174.1914 80.2681 56.5366 57.4640 6.7957 8.1287 7.8703 8.8897 15.4497 9.5942 13.3991 13.2581 132.5742 45.0200 38.1389
temp: 298.150 k
press: 1.00000 atm
elementType: 8 8 8 7 6 6 6 6 6 6 6 6 6 6 6 6 6 6 6 1 1 1 1 1 1 1 1 1 1 1
symmnumber: 1
zpe: 590438.8 jmol-1
zpe.correction: 0.224886 hartree
zpe.thermalcorrener: 0.239806 hartree
zpe.thermalcorrenthalpy: 0.240750 hartree
zpe.thermalcorrgfe: 0.182855 hartree
zpe.sumelectzpe: -857.340487 hartree
zpe.sumelectthermal: -857.325567 hartree
zpe.sumelectthermalent: -857.324623 hartree
zpe.sumelectthermalfe: -857.382518 hartree
dipole: -2.5563 -2.5332 -0.8379
dipole: 3.6951
quadrupole: -100.7718 -110.4537 -108.9663
quadrupole: 7.2514 -0.3992 -6.2977
quadrupole: 5.9588 -3.7231 -2.2357 7.2514 -0.3992 -6.2977
hfenergy: -857.5653731 hartree
pointgroup: C01 [X(C15H11N1O3)]
dipole: 0.9571522 -1.0940317 -0.0195465 debye
polarizability: 247.0534893|-5.1670312|210.4310372|-5.3905438|43.4789498|112.0141202 unknown
InChI: InChI=1S/C15H11NO3/c17-10-5-3-4-9(8-10)13-11-6-1-2-7-12(11)16-15(19)14(13)18/h1-8,16-18H
charge 0 multiplicity 1
30 atoms
O  -0.432125 2.663577 0.611971
O  2.153506 3.318868 0.75419
O  -4.645402 0.373861 1.571001
N  2.845479 1.125088 0.259439
C  0.117745 0.340028 0.067085
C  1.193611 -0.644589 -0.098251
C  2.565328 -0.224037 -0.0117
C  -1.318012 -0.023127 -0.125928
C  0.480962 1.640893 0.395472
C  0.953929 -2.037264 -0.302801
C  1.880028 2.092127 0.493621
C  3.63172 -1.144009 -0.177241
C  -2.287142 0.352897 0.83886
C  -1.741942 -0.71449 -1.293994
C  2.009601 -2.950123 -0.456011
C  3.356357 -2.502001 -0.406543
C  -3.647657 0.026745 0.64374
C  -3.107256 -1.028173 -1.477768
C  -4.069508 -0.669618 -0.512039
H  3.820005 1.43663 0.312052
H  -0.078973 -2.395346 -0.321577
H  4.6680 -0.789777 -0.11573
H  -1.973314 0.913326 1.727164
H  -1.012508 -0.972195 -2.068228
H  1.792481 -4.012364 -0.607754
H  4.179985 -3.212388 -0.532703
H  -3.426016 -1.550849 -2.386082
H  -5.130534 -0.904217 -0.637128
H  0.119301 3.493064 0.761497
H  -4.263651 0.895162 2.320284
