program: Gaussian 09
title: 000115006
version: EM64L-G09RevD.01
frameworkgroup: C1[X(C10H4Cl4)]
method: RPBEPBE
basis: SDD
operation: Freq
keyword: #pfreq=noraman
keyword: PBEPBE/SDD
title: #p freq=noraman PBEPBE/SDD
converged: NO YES NO YES
title: Mulliken charges:
elementType: Cl Cl Cl Cl C C C C C C C C C C H H H H
charge: 0.006627 0.007032 0.004457 0.005308 0.470387 0.451897 -0.351055 -0.406768 -0.277590 -0.442557 -0.091532 -0.105777 -0.123958 -0.225725 0.287561 0.271745 0.255484 0.264464
chargesum: 0.00000
title: Mulliken charges with hydrogens summed into heavy atoms:
elementType: Cl Cl Cl Cl C C C C C C C C C C
charge: 0.006627 0.007032 0.004457 0.005308 0.470387 0.451897 -0.063494 -0.135023 -0.277590 -0.187074 -0.091532 -0.105777 -0.123958 0.038739
polarizability: 2.54632838e+02 7.96544511e+00 1.57292854e+02 9.50620002e-04 -6.90265800e-03 5.12585837e+01
1716.lowfreq: -0.0026 -0.0009 0.0033 3.5857 9.3212 11.0906 56.0438 60.3135 140.5888
frequency: 56.0388 60.3089 140.5880 142.8212 183.3993 183.6444 197.0476 258.6405 289.6665 293.9950 330.1569 378.7930 423.5603 427.7948 454.5953 514.5255 542.7741 569.1705 623.7623 655.2000 660.0922 681.5135 759.4199 806.0439 842.8053 886.4369 887.9510 893.7763 957.3183 963.8815 1115.7244 1135.5618 1159.2634 1227.3005 1257.6728 1267.2008 1366.0406 1391.1722 1410.7897 1431.5580 1479.2332 1553.9615 1578.3619 1617.3491 3148.1310 3158.2385 3176.0198 3176.7548
redmass: 24.9373 14.9786 20.0570 6.9451 30.8380 6.2830 30.6213 18.6885 23.8338 6.0768 7.0894 10.2838 3.1967 9.7455 12.0933 5.2972 4.0954 5.8427 8.6453 5.3928 8.2182 8.0909 3.4456 1.3493 5.3878 1.6176 9.0090 1.4341 7.5677 1.3734 2.0353 2.4646 1.7544 1.8226 1.4691 3.2136 4.5393 6.7817 3.4963 4.0607 4.4393 9.9022 6.9048 7.6421 1.0892 1.0925 1.0970 1.0921
irintensity: 0.0796 0.3371 0.2513 0.4580 0.0442 0.0183 0.0162 0.2179 0.0878 2.2215 1.1432 3.8157 10.8577 2.9177 23.8499 10.2365 1.2602 5.3492 38.9395 0.7695 1.6173 8.5698 1.9301 21.0687 0.9699 6.8446 44.9553 54.2831 84.6631 3.0011 41.9494 60.1609 12.7104 27.4610 15.5141 23.5988 2.1023 33.6406 3.9650 10.5774 82.0358 18.2809 31.4117 11.4116 3.1000 0.5447 2.7242 3.2676
temp: 298.150 k
press: 1.00000 atm
elementType: 17 17 17 17 6 6 6 6 6 6 6 6 6 6 1 1 1 1
symmnumber: 1
zpe: 279424.1 jmol-1
zpe.correction: 0.106427 hartree
zpe.thermalcorrener: 0.118586 hartree
zpe.thermalcorrenthalpy: 0.119530 hartree
zpe.thermalcorrgfe: 0.066486 hartree
zpe.sumelectzpe: -2222.742519 hartree
zpe.sumelectthermal: -2222.730360 hartree
zpe.sumelectthermalent: -2222.729416 hartree
zpe.sumelectthermalfe: -2222.782460 hartree
dipole: -0.6570 -2.6500 0.0002
dipole: 2.7302
quadrupole: -117.8141 -97.1895 -110.3628
quadrupole: 2.8294 -0.0003 -0.0010
quadrupole: -9.3587 11.2660 -1.9073 2.8294 -0.0003 -0.0010
hfenergy: -2222.8489462 hartree
pointgroup: C01 [X(C10H4Cl4)]
dipole: 0.3158311 1.026665 0.000091 debye
dipolederiv: -0.1053966 0.1052977 0.0000094 0.2393349 -0.6320842 -0.0000488 0.0000144 -0.0000316 -0.0184039 -0.5325657 -0.2941141 -0.0000118 -0.464806 -0.3496182 -0.0000127 -0.0000152 -0.0000095 -0.0237764 -0.7869658 0.1861361 0.0000266 0.2999566 -0.1317947 -0.0000133 0.0000545 -0.0000152 -0.0233509 -0.8464351 0.0865539 -0.0000112 0.200232 -0.0736903 -0.0000004 -0.0000161 -0.0000005 -0.0243927 0.1604559 0.1201346 0.0000038 0.1374198 -0.231047 -0.0000274 0.0000026 -0.000015 0.0478902 0.0763391 0.0419577 0.0000025 -0.0550914 -0.0588042 -0.0000036 0.0000021 -0.0000106 0.0440232 -0.2966282 -0.1813857 -0.000008 -0.0025917 -0.1244022 -0.0000022 0.0000127 0.0000031 -0.0891759 -0.2197628 0.0934142 0.0000106 -0.0379956 -0.0098639 0.0000115 0.0000072 0.0000117 -0.1003001 -0.1563969 -0.2422647 -0.0000249 -0.3489734 0.9214412 0.0000817 -0.0000422 0.000049 -0.0639449 0.0385117 -0.0041558 0.0000021 0.1081671 0.0958721 0.0000193 0.000005 0.0000327 -0.1610316 0.5599525 0.6638894 0.0000321 0.6791829 0.5500136 0.0000232 0.0000327 0.0000153 -0.0473983 0.9961351 -0.5240023 -0.0000596 -0.5212086 0.0867184 0.0000195 -0.0000857 0.0000257 -0.0539969 1.1681954 -0.1273015 0.0000274 -0.3143497 -0.084296 -0.0000136 0.0000313 0. -0.0432979 -0.3008034 0.0471106 0.000001 0.1048762 0.0410043 0.0000172 0.0000048 0.0000097 -0.1000192 0.1016868 0.0349646 0.0000031 -0.018354 0.038309 -0.0000069 -0.0000019 -0.0000089 0.1662909 0.071565 -0.0119117 0. 0.0317316 -0.0204531 -0.0000156 0.0000031 -0.0000191 0.1623452 0.0569199 0.0698847 0.0000048 0.0076497 -0.0566414 -0.0000173 0.000001 -0.000024 0.1621059 0.0151931 -0.0642077 -0.0000081 -0.0451803 0.0393365 -0.0000106 -0.0000101 -0.0000131 0.1664331 unknown
polarizability: 255.2151663|2.53484|156.7105255|-0.0005669|0.0069447|51.2585837 unknown
InChI: InChI=1S/C10H4Cl4/c11-7-2-1-5-3-8(12)9(13)4-6(5)10(7)14/h1-4H
charge 0 multiplicity 1
18 atoms
Cl 2.024649 -2.541443 -0.000232
Cl -3.489716 -2.032947 -0.0001
Cl -4.137841 1.174705 0.000115
Cl 4.405075 -0.320834 0.000015
C  0.261231 -0.355107 -0.000065
C  -0.025909 1.067409 0.00004
C  -0.829964 -1.280499 -0.0001
C  -1.389142 1.500415 0.000075
C  1.638338 -0.770659 -0.000115
C  1.054202 2.008134 0.000093
C  -2.145884 -0.823908 -0.000062
C  -2.431227 0.5775 0.000018
C  2.666267 0.173517 -0.000018
C  2.376273 1.571753 0.000082
H  -0.63053 -2.35486 -0.000162
H  -1.614773 2.571403 0.000171
H  0.83386 3.080527 0.000184
H  3.20759 2.282095 0.000162
