program: Gaussian 09
title: 000115005
version: EM64L-G09RevD.01
frameworkgroup: C1[X(C15H21N5O7S)]
method: RPBEPBE
basis: SDD
operation: Freq
keyword: #p
keyword: freq=noraman
keyword: PBEPBE/SDD
title: #p freq=noraman PBEPBE/SDD
converged: YES YES NO NO
title: Mulliken charges:
elementType: S O O O O O O O N N N N N C C C C C C C C C C C C C C C H H H H H H H H H H H H H H H H H H H H H
charge: 1.150899 -0.436622 -0.411889 -0.531639 -0.469555 -0.481440 -0.229943 -0.229633 -0.299915 -0.378854 -0.110997 -0.440576 -0.385216 0.002540 -0.049852 -0.083760 -0.509250 -0.129082 -0.449544 -0.078394 0.164345 -0.524749 -0.744959 -0.321087 0.458278 -0.428806 0.130322 0.173116 0.268750 0.261410 0.230390 0.250791 0.227215 0.285844 0.220112 0.235081 0.213522 0.230703 0.215015 0.344323 0.227795 0.221802 0.232980 0.265283 0.350696 0.342231 0.268224 0.384035 0.370060
chargesum: 0.00000
title: Mulliken charges with hydrogens summed into heavy atoms:
elementType: S O O O O O O O N N N N N C C C C C C C C C C C C C C C
charge: 1.150899 -0.436622 -0.061193 -0.147604 -0.469555 -0.481440 -0.229943 -0.229633 -0.299915 -0.034531 -0.110997 -0.098346 -0.015156 0.271290 0.211558 0.146630 -0.031245 0.156762 0.005649 0.135128 0.164345 -0.079032 -0.062381 -0.055804 0.458278 -0.160582 0.130322 0.173116
polarizability: 3.32787747e+02 5.47083636e+01 3.99523661e+02 1.42302975e+01 -1.24862976e+00 2.09367975e+02
1716.lowfreq: -6.7541 -0.0021 -0.0016 -0.0013 3.5497 5.3120 13.8317 16.6925 24.2522
frequency: 13.7058 16.5282 24.2340 28.4883 32.6279 59.8448 66.9098 73.0801 100.7426 111.3330 124.7389 133.7644 141.6009 148.3687 162.3004 170.2672 183.0923 195.8008 207.1607 213.7445 218.2081 234.8986 249.4459 255.7205 269.9909 280.2886 303.1012 312.7990 318.4660 362.9412 365.9834 392.5006 403.8245 421.6546 429.8399 453.8661 470.3375 495.0369 505.7627 531.6854 546.8066 558.3492 569.6982 595.7047 611.4093 618.7169 620.7869 653.5045 658.3667 689.2990 698.0068 703.5128 712.4629 719.3411 758.6897 775.2861 816.9833 837.3730 838.2384 849.1254 868.8736 897.9892 918.3159 937.3493 944.4418 947.5160 956.2015 959.5487 972.1262 995.1950 1000.9770 1012.9305 1031.2346 1046.7304 1067.2825 1077.2555 1078.6853 1090.4221 1111.2422 1122.4943 1142.9572 1154.3622 1167.5908 1178.3830 1193.6043 1206.0668 1207.5863 1211.8087 1241.0699 1253.8045 1262.8878 1268.1413 1277.8699 1285.8515 1289.9066 1301.5384 1307.1267 1311.0674 1315.1217 1337.2570 1340.9335 1343.8017 1355.1144 1358.9603 1363.2457 1369.9749 1375.4128 1392.5553 1400.5010 1445.9624 1455.0538 1457.3104 1460.9628 1469.6134 1476.1882 1480.9792 1593.1635 1612.2971 1664.5481 1682.1924 2846.9736 2908.4195 2919.6691 2945.8558 2963.0999 2985.1149 2987.4546 2998.8141 3000.9779 3051.3897 3055.7030 3071.0130 3079.9673 3080.8922 3089.7036 3206.7726 3472.7626 3524.5777 3537.5620 3551.4601 3554.6733
redmass: 12.1061 7.5090 8.5552 9.3266 7.8665 2.8807 5.0735 2.5665 4.5678 6.9019 4.6905 6.1534 3.4412 5.4485 7.3767 3.8242 4.7558 5.6604 1.5734 1.6763 1.2852 3.7765 2.9775 3.1570 7.2022 5.8994 6.2106 6.3859 5.9938 4.6712 9.4389 3.5049 3.7165 3.0267 6.3674 4.2752 3.1943 4.7934 7.5229 6.6055 3.9849 12.9836 4.7621 4.6191 1.5343 1.3435 2.3045 7.7831 3.1221 3.9289 3.5008 2.2981 3.2607 3.3561 3.8014 1.8895 4.5639 2.7183 1.6809 10.2051 2.5587 3.7369 2.7481 1.5996 4.8542 2.8307 4.8967 2.5427 3.2421 3.2971 2.1012 3.8649 2.6918 3.1307 2.3327 1.6436 1.6008 2.1799 2.5663 1.8958 2.1687 1.7000 2.4138 1.5416 1.5664 1.4544 2.8822 1.9909 1.4191 1.9632 1.3168 1.4237 1.4892 1.3094 1.3841 1.2711 1.6151 1.5372 1.3538 1.4100 1.5896 2.4465 1.5890 1.4006 1.3515 1.3222 1.6942 1.2085 1.7167 1.1375 1.9478 1.3910 1.1010 2.5011 1.0784 1.0553 6.7605 7.2548 6.9213 5.7457 1.0814 1.0823 1.0829 1.0701 1.0828 1.0676 1.0365 1.0709 1.0681 1.1022 1.0933 1.1012 1.0993 1.0870 1.0997 1.0945 1.0659 1.0772 1.0778 1.0667 1.0772
irintensity: 3.4402 0.1789 0.5665 0.9167 3.2195 23.0913 2.3770 44.2274 6.4979 1.0776 26.9044 22.6684 6.5684 6.6230 0.9256 3.0900 5.1932 2.0133 21.8112 34.9406 111.4356 9.8293 33.0621 5.7798 5.2428 48.1550 74.8264 21.1724 10.3240 15.6413 33.3910 9.0115 2.5464 25.6378 64.3362 7.5376 4.1109 7.4497 14.2047 7.3316 9.9474 362.7348 10.6842 2.1379 54.6829 85.6813 30.9482 33.7530 7.5142 13.7502 8.2726 69.9689 6.2119 6.5221 5.0484 105.6652 4.9312 2.6611 74.2719 153.5397 2.2116 52.1988 0.3982 19.4403 47.8909 5.6249 54.5103 57.6074 29.0104 9.6455 14.6363 22.5849 5.7378 10.7997 16.9624 51.1001 45.5542 2.4383 1.1498 3.7949 14.6486 10.8657 19.8867 11.4888 21.7118 10.2300 28.7339 18.3839 8.7528 3.4947 4.1540 24.4868 101.0688 57.4808 5.2437 7.3259 14.3183 38.4684 1.8137 18.3338 27.9347 82.4829 2.1698 30.5409 17.8568 30.0440 84.4044 25.4682 26.9717 3.9195 43.1412 43.1981 6.9298 33.2381 14.5458 4.8649 1058.0663 80.3937 374.5588 634.2181 123.3013 32.6730 18.9861 60.2611 13.6178 3.2176 26.6206 11.0513 36.5317 5.2062 27.7086 15.7760 14.2374 12.0770 21.5050 2.2955 106.7746 71.0748 68.6850 22.6572 147.8323
temp: 298.150 k
press: 1.00000 atm
elementType: 16 8 8 8 8 8 8 8 7 7 7 7 7 6 6 6 6 6 6 6 6 6 6 6 6 6 6 6 1 1 1 1 1 1 1 1 1 1 1 1 1 1 1 1 1 1 1 1 1
symmnumber: 1
zpe: 976145.5 jmol-1
zpe.correction: 0.371794 hartree
zpe.thermalcorrener: 0.399860 hartree
zpe.thermalcorrenthalpy: 0.400804 hartree
zpe.thermalcorrgfe: 0.310194 hartree
zpe.sumelectzpe: -1780.291693 hartree
zpe.sumelectthermal: -1780.263627 hartree
zpe.sumelectthermalent: -1780.262683 hartree
zpe.sumelectthermalfe: -1780.353292 hartree
dipole: -2.7615 4.1629 0.3288
dipole: 5.0064
quadrupole: -178.6576 -213.9279 -180.6122
quadrupole: -3.3227 -11.0202 -0.6062
quadrupole: 12.4083 -22.8620 10.4537 -3.3227 -11.0202 -0.6062
hfenergy: -1780.6634867 hartree
pointgroup: C01 [X(C15H21N5O7S1)]
dipole: 1.273837 -1.4920474 0.1751413 debye
polarizability: 320.3978513|44.5953078|410.8807132|-18.1865028|-10.2638038|210.4008185 unknown
InChI: InChI=1S/C15H21N5O7S/c1-6-10-5-16-14-17-8(13(22)9-4-12(21)19-15(23)18-9)2-7(20(10)14)3-11(6)27-28(24,25)26/h4,6-8,10-11,13,17-19,22,24H,2-3,5H2,1H3
charge 0 multiplicity 1
49 atoms
S  3.382484 3.255371 -0.37669
O  3.65696 1.364255 -0.405763
O  -3.017239 -2.935123 -0.523954
O  4.427434 3.518852 -1.862127
O  1.900209 3.693254 -0.810081
O  4.047176 3.853701 0.967753
O  -4.680201 1.778985 -2.251109
O  -6.043354 1.116439 2.18792
N  1.707712 -1.338395 -0.058518
N  -0.28673 -2.618351 -0.276201
N  1.912594 -3.590099 -0.530263
N  -3.648633 0.105928 -0.97722
N  -5.352632 1.417818 -0.024963
C  1.051587 -0.047333 0.147131
C  3.156755 -1.464007 -0.312123
C  3.952084 -0.717194 0.781467
C  1.859712 0.738228 1.212157
C  3.375925 0.727487 0.910614
C  -0.411387 -0.302838 0.582695
C  -1.085243 -1.386022 -0.29893
C  1.093099 -2.568088 -0.307004
C  3.296976 -3.026143 -0.360312
C  5.469358 -0.739979 0.517317
C  -2.50229 -1.757246 0.218261
C  -3.502144 -0.616029 0.215027
C  -4.28495 -0.311528 1.303063
C  -4.580196 1.156992 -1.16366
C  -5.283105 0.760816 1.246313
H  1.062087 0.541887 -0.798015
H  3.411528 -0.999373 -1.29269
H  3.740444 -1.206567 1.757122
H  1.488531 1.779133 1.270104
H  1.707849 0.273513 2.206167
H  3.928792 1.277275 1.698706
H  -0.426863 -0.64725 1.634764
H  -0.976902 0.644038 0.522537
H  -1.163816 -0.993589 -1.345043
H  3.94273 -3.364183 -1.188265
H  3.737777 -3.406937 0.58674
H  -0.750518 -3.49783 -0.511478
H  5.706729 -0.293044 -0.463756
H  6.018024 -0.174386 1.292305
H  5.849859 -1.776978 0.525506
H  -2.400351 -2.134456 1.248439
H  -3.41339 -2.652581 -1.388399
H  -3.032212 -0.054597 -1.777437
H  -4.201434 -0.87202 2.234618
H  5.222818 2.917916 -1.756813
H  -6.042043 2.171675 -0.113113
