program: Gaussian 09
title: 000114943
version: EM64L-G09RevD.01
frameworkgroup: C1[X(C17H14N)]
method: RPBEPBE
basis: SDD
operation: Freq
keyword: #p
keyword: freq=noraman
keyword: PBEPBE/SDD
title: #p freq=noraman PBEPBE/SDD
converged: NO YES NO NO
title: Mulliken charges:
elementType: N C C C C C C C C C C C C C C C C C H H H H H H H H H H H H H H
charge: -0.153290 -0.399743 -0.571727 0.289803 0.379168 0.194488 -0.366949 -0.425282 0.359993 0.399501 -0.409008 -0.359265 -0.355176 -0.384816 -0.208250 -0.243878 -0.214316 -0.203697 0.284839 0.248104 0.266057 0.257341 0.278691 0.267645 0.257330 0.240490 0.259762 0.264933 0.259067 0.256211 0.266693 0.265283
chargesum: 1.00000
title: Mulliken charges with hydrogens summed into heavy atoms:
elementType: N C C C C C C C C C C C C C C C C C
charge: -0.153290 0.133200 -0.048328 0.289803 0.379168 0.194488 -0.088257 -0.157638 0.359993 0.399501 -0.151678 -0.118775 -0.095414 -0.119883 0.050816 0.012333 0.052376 0.061586
polarizability: 3.47822302e+02 -4.36137773e-01 1.89330781e+02 4.07808295e-01 1.14044704e+00 8.03053028e+01
1716.lowfreq: -4.9074 -0.0007 -0.0006 -0.0005 6.5767 9.2677 58.3056 74.4252 128.4995
frequency: 58.2957 74.4187 128.4970 143.1368 189.1537 228.6090 266.3852 294.5858 321.3788 354.1523 402.1103 426.6518 459.0488 465.0009 467.7014 492.4529 519.6544 539.9485 571.4572 594.0173 626.8155 661.2136 699.5459 718.9362 736.7840 766.8914 769.5793 770.6052 784.2393 805.7424 871.7973 882.5064 887.8834 909.9364 915.5585 925.8958 966.6542 980.7032 986.3727 1008.2238 1010.0387 1017.3373 1020.5383 1042.3409 1057.6008 1100.2173 1129.9893 1152.7531 1187.7229 1188.7136 1196.7233 1208.3710 1223.2827 1232.8476 1270.0249 1270.9540 1299.7353 1309.0130 1336.7376 1345.1159 1356.5603 1384.4316 1392.2005 1436.0949 1441.6385 1450.4000 1454.5081 1460.8919 1472.8408 1496.8866 1518.6465 1561.5320 1582.2507 1604.7337 1612.9461 1636.1424 2990.4009 3017.9989 3072.4519 3101.3435 3140.5482 3146.1714 3146.6029 3151.4078 3161.4729 3167.1735 3171.0009 3178.7231 3180.2112 3182.3958
redmass: 4.6344 3.8762 4.2869 3.7018 4.0210 3.1686 3.3063 5.5830 2.9279 4.2052 3.2727 3.8348 3.1998 3.5741 2.7233 4.1024 5.2476 3.4156 6.4799 3.2077 6.3213 4.3447 4.1786 4.9644 2.6300 2.3891 1.6137 2.8469 1.6304 3.6177 1.3119 1.9630 2.3197 2.2204 1.4860 1.6172 1.4044 4.1772 1.3835 1.4679 2.2178 1.3830 2.2528 2.3228 2.0832 2.9975 2.0122 1.6534 1.0861 1.0936 1.2723 1.7477 1.3444 1.5842 1.9341 1.8773 1.6555 2.0671 2.1522 1.3667 1.7629 2.8605 3.9188 2.3116 4.2019 2.2426 1.2766 1.3937 1.6723 2.9164 3.6030 5.8492 6.2447 5.9496 6.2591 6.6169 1.0670 1.0621 1.0959 1.1036 1.0889 1.0894 1.0891 1.0900 1.0940 1.0958 1.0940 1.0973 1.0956 1.1004
irintensity: 0.3683 0.1618 0.1554 2.9044 1.6983 0.8990 1.4503 0.5606 2.0463 0.2287 2.7406 2.1521 0.8370 5.7349 19.5741 8.3432 2.4514 1.0176 3.2491 1.7147 0.2178 3.7822 8.8753 2.7818 16.4411 3.2501 18.9002 17.6997 82.1258 1.7302 0.2297 1.3012 0.5265 2.8226 52.0539 0.0859 0.9097 1.2810 4.9018 0.3901 2.6480 0.1128 1.6364 0.9229 1.4923 3.9765 18.6952 6.5253 2.5013 0.7576 1.2390 4.0171 10.5827 27.6562 4.9088 13.1173 1.8793 9.5008 18.5306 4.9988 16.7274 21.8159 2.7616 11.9361 52.0158 1.3093 33.7002 1.8111 15.0857 2.7927 133.7111 2.2298 1.2287 89.9896 24.5992 105.7223 8.8327 8.4830 7.3157 7.4046 5.1702 0.8868 0.8664 0.0150 7.1728 4.5148 0.2765 2.9268 8.6638 4.5902
temp: 298.150 k
press: 1.00000 atm
elementType: 7 6 6 6 6 6 6 6 6 6 6 6 6 6 6 6 6 6 1 1 1 1 1 1 1 1 1 1 1 1 1 1
symmnumber: 1
zpe: 687513.0 jmol-1
zpe.correction: 0.261860 hartree
zpe.thermalcorrener: 0.274672 hartree
zpe.thermalcorrenthalpy: 0.275617 hartree
zpe.thermalcorrgfe: 0.222774 hartree
zpe.sumelectzpe: -709.548786 hartree
zpe.sumelectthermal: -709.535973 hartree
zpe.sumelectthermalent: -709.535029 hartree
zpe.sumelectthermalfe: -709.587871 hartree
dipole: 2.0201 2.1657 -0.2572
dipole: 2.9728
quadrupole: -42.7574 -70.8315 -106.6589
quadrupole: -1.7045 -0.0373 -0.6420
quadrupole: 30.6585 2.5844 -33.2429 -1.7045 -0.0373 -0.6420
hfenergy: -709.8106456 hartree
pointgroup: C01 [X(C17H14N1)]
dipole: 0.7988757 0.848147 -0.1016928 debye
polarizability: 347.8143981|-1.2383352|189.3364076|-0.0947273|1.2711173|80.3075805 unknown
InChI: InChI=1S/C17H14N/c1-2-7-15-12-18-10-9-13-5-3-4-8-16(13)17(18)11-14(15)6-1/h1-8,11-12H,9-10H2
charge 1 multiplicity 1
32 atoms
N  0.07543 1.250191 -0.205992
C  -0.970551 2.317349 -0.402543
C  -2.170821 2.058819 0.517144
C  -0.346871 -0.091183 -0.071003
C  -2.720405 0.667682 0.252765
C  -1.796532 -0.373887 -0.064738
C  1.391403 1.597963 -0.207702
C  0.647116 -1.067992 0.072641
C  2.421537 0.640224 -0.081576
C  2.036351 -0.753552 0.062866
C  -4.099085 0.380019 0.319603
C  -2.283562 -1.683586 -0.330707
C  3.808261 1.00966 -0.086882
C  3.062709 -1.740838 0.201498
C  -4.573492 -0.927307 0.070277
C  -3.662142 -1.958178 -0.261981
C  4.782281 0.021508 0.046489
C  4.405851 -1.356607 0.191498
H  -1.282932 2.282835 -1.46282
H  -0.498703 3.29192 -0.199386
H  -2.937802 2.827831 0.321622
H  -1.867178 2.168965 1.577171
H  1.614501 2.662938 -0.317019
H  0.338988 -2.105567 0.221646
H  -4.806056 1.180005 0.565733
H  -1.59684 -2.485953 -0.619159
H  4.090377 2.062384 -0.196694
H  2.786665 -2.794307 0.314611
H  -5.64604 -1.139303 0.122015
H  -4.028426 -2.967057 -0.474563
H  5.842872 0.290189 0.042206
H  5.189295 -2.113864 0.296382
