program: Gaussian 09
title: 000114918
version: EM64L-G09RevD.01
frameworkgroup: C1[X(C14H8N2O6)]
method: RPBEPBE
basis: SDD
operation: Freq
keyword: #p
keyword: freq=noraman
keyword: PBEPBE/SDD
title: #p freq=noraman PBEPBE/SDD
converged: YES YES NO NO
title: Mulliken charges:
elementType: O O O O O O N N C C C C C C C C C C C C C C H H H H H H H H
charge: -0.245465 -0.254329 -0.377089 -0.436112 -0.333531 -0.200958 0.091288 -0.616553 -0.045369 0.343074 -0.085692 0.269113 0.124793 0.128890 0.215218 -0.544031 0.043746 -0.363083 -0.328926 -0.207532 0.148630 0.088558 0.288438 0.269264 0.276172 0.245386 0.390322 0.353299 0.381169 0.381313
chargesum: 0.00000
title: Mulliken charges with hydrogens summed into heavy atoms:
elementType: O O O O O O N N C C C C C C C C C C C C C C
charge: -0.245465 -0.254329 0.004080 -0.054800 -0.333531 -0.200958 0.091288 0.127067 -0.045369 0.343074 -0.085692 0.269113 0.124793 0.128890 0.215218 -0.255593 0.043746 -0.093819 -0.052754 0.037854 0.148630 0.088558
polarizability: 4.08349008e+02 7.84633617e+00 2.15913419e+02 1.24901826e+01 3.00270583e+00 7.66042830e+01
1716.lowfreq: -6.8326 -0.0009 -0.0005 -0.0005 1.6616 3.4383 25.9820 44.6993 52.7776
frequency: 25.9808 44.6955 52.7768 76.5577 96.8120 115.6576 122.6528 172.5580 187.3494 204.3159 262.0381 275.7499 298.3989 318.1308 331.1937 357.2373 371.5629 384.0011 413.3257 432.9239 438.4075 473.9252 482.2528 529.4263 541.2759 562.8460 574.1187 584.0564 593.0050 608.0088 628.9389 671.7808 681.9145 700.2123 715.4613 720.3771 750.7026 755.5157 759.6192 779.3468 810.1099 826.1147 841.4223 863.9152 873.5448 906.5864 923.8753 938.6394 983.4364 1036.9438 1053.8875 1069.7350 1145.0825 1156.2061 1164.7906 1192.2844 1205.1648 1230.7820 1266.1046 1292.4939 1303.6744 1340.8131 1369.4868 1384.5458 1406.2377 1413.3369 1457.8145 1466.9535 1481.0741 1539.9931 1567.3841 1577.4950 1586.8507 1601.4074 1633.3776 1660.1148 3155.0312 3172.8570 3182.9734 3187.3766 3334.4350 3496.2830 3520.4364 3525.3819
redmass: 8.0468 10.0105 8.8114 7.5723 9.2121 8.1145 8.7097 6.4214 7.6327 6.3473 7.1847 6.1309 7.5116 7.0627 6.8883 9.1691 3.6601 8.4492 7.7276 7.1829 6.2424 6.2379 3.8036 4.9510 3.3578 9.0378 4.0649 3.3037 1.7443 1.5859 4.2807 6.2426 4.9237 6.4114 3.1312 5.6367 1.5132 3.1501 3.9383 4.0590 1.9777 5.7408 1.1701 1.6592 4.3193 7.6844 1.4322 5.2965 1.3573 3.0263 2.6097 2.0426 3.4477 1.8789 1.3604 2.4372 2.0202 2.5408 3.8609 3.1351 2.3609 4.0755 3.7715 5.1362 4.6088 3.5896 4.1575 5.0631 2.2709 9.0557 6.5762 4.1994 5.1327 5.8866 7.3153 9.2501 1.0876 1.0941 1.0929 1.0977 1.0498 1.0637 1.0641 1.1010
irintensity: 0.4287 1.4718 0.3932 0.8716 0.5480 1.7554 5.3892 0.4820 2.6847 0.0693 0.4014 1.6347 1.4407 4.1208 2.7749 9.2437 15.2540 1.7256 9.4638 0.8047 8.8241 5.1756 6.8491 10.8399 15.4354 26.4173 62.3209 27.6524 32.8826 99.0063 73.6402 3.6327 5.1120 4.4743 72.6853 6.4692 98.9758 6.7389 16.3170 23.9620 38.5996 15.5553 100.0815 85.3559 2.2293 86.2807 0.9957 86.3020 5.5800 194.6396 329.0645 24.3889 12.0880 51.1399 19.1306 48.3761 5.6405 7.3984 19.9089 4.2151 92.9265 64.3035 69.9801 32.8934 10.4367 7.4256 36.8768 13.6821 385.9924 246.7923 8.1080 195.6118 627.7879 221.4356 35.5196 166.6574 2.0641 3.4405 0.1822 7.2024 251.5460 44.5302 41.3880 115.8101
temp: 298.150 k
press: 1.00000 atm
elementType: 8 8 8 8 8 8 7 7 6 6 6 6 6 6 6 6 6 6 6 6 6 6 1 1 1 1 1 1 1 1
symmnumber: 1
zpe: 527801.8 jmol-1
zpe.correction: 0.201029 hartree
zpe.thermalcorrener: 0.218708 hartree
zpe.thermalcorrenthalpy: 0.219653 hartree
zpe.thermalcorrgfe: 0.154667 hartree
zpe.sumelectzpe: -1097.629026 hartree
zpe.sumelectthermal: -1097.611347 hartree
zpe.sumelectthermalent: -1097.610403 hartree
zpe.sumelectthermalfe: -1097.675389 hartree
dipole: -3.8628 -0.9087 -1.0450
dipole: 4.1036
quadrupole: -113.2148 -115.8607 -128.3502
quadrupole: 9.8770 -0.6979 -3.0780
quadrupole: 5.9271 3.2812 -9.2083 9.8770 -0.6979 -3.0780
hfenergy: -1097.8300555 hartree
pointgroup: C01 [X(C14H8N2O6)]
dipole: 1.5378826 -0.2992046 0.3897565 debye
polarizability: 409.0193543|-1.8532927|215.3201793|5.9513604|-6.8984702|76.5271769 unknown
InChI: InChI=1S/C14H8N2O6/c15-10-6(17)4-8-12(9(10)14(20)21)16-11-5(13(18)19)2-1-3-7(11)22-8/h1-4,18,20H,15H2
charge 0 multiplicity 1
30 atoms
O  0.237044 -2.316999 0.118161
O  -4.521635 -2.008068 -0.131613
O  -0.883025 2.807523 0.587221
O  4.227639 2.252934 0.081674
O  -3.104902 2.886573 -0.000562
O  2.315178 2.484017 -1.217447
N  0.423706 0.520912 -0.084199
N  -4.464202 0.651174 -0.12279
C  -0.784375 -0.062651 0.012299
C  -0.925233 -1.541464 0.038785
C  1.564553 -0.279644 -0.101759
C  1.495977 -1.697302 0.061374
C  -2.011092 0.71964 0.050201
C  -3.259584 0.043076 -0.051219
C  2.87232 0.304474 -0.209254
C  -2.125516 -2.214106 0.005801
C  -3.359553 -1.472652 -0.06619
C  2.627769 -2.521679 0.165324
C  4.01549 -0.515054 -0.085936
C  3.897513 -1.915365 0.10013
C  -2.051118 2.188204 0.180108
C  3.043072 1.758348 -0.510402
H  -2.164157 -3.305876 0.021656
H  2.502002 -3.600521 0.293938
H  5.002153 -0.048873 -0.14347
H  4.798352 -2.53053 0.184619
H  -4.491217 1.681904 -0.146857
H  -5.283079 0.033625 -0.168607
H  -1.05377 3.789362 0.616149
H  4.330389 3.208218 -0.178337
