program: Gaussian 09
title: 000114917
version: EM64L-G09RevD.01
frameworkgroup: C1[X(C18H12O3)]
method: RPBEPBE
basis: SDD
operation: Freq
keyword: #pfreq=noraman
keyword: PBEPBE/SDD
title: #p freq=noraman PBEPBE/SDD
converged: NO YES NO NO
title: Mulliken charges:
elementType: O O O C C C C C C C C C C C C C C C C C C H H H H H H H H H H H H
charge: -0.227521 -0.166347 -0.138921 0.119144 0.428183 0.245921 0.074637 -0.017232 0.223411 -0.121294 -0.483215 0.324331 -0.181689 -0.417231 0.332060 -0.390030 -0.324689 -0.457373 -0.238867 -0.778237 -0.834811 0.273812 0.256062 0.313174 0.279142 0.237757 0.232570 0.252958 0.219839 0.252956 0.234201 0.243083 0.234215
chargesum: 0.00000
title: Mulliken charges with hydrogens summed into heavy atoms:
elementType: O O O C C C C C C C C C C C C C C C C C C
charge: -0.227521 -0.166347 -0.138921 0.119144 0.428183 0.245921 0.074637 -0.017232 0.223411 -0.121294 -0.209402 0.324331 -0.181689 -0.161169 0.332060 -0.076857 -0.045547 -0.219616 -0.006297 -0.052483 -0.123312
polarizability: 3.75321335e+02 8.71453949e+00 2.32772473e+02 4.91733727e-03 6.76197695e-03 8.55403537e+01
1716.lowfreq: -0.0008 0.0003 0.0007 0.7625 9.2618 11.6518 35.5532 52.4824 68.3321
frequency: 35.5375 52.4715 68.3227 100.9498 119.8745 139.3358 168.2284 180.3693 196.3075 215.6042 241.9478 265.5866 271.0631 290.9039 352.9151 364.3550 387.5610 390.6693 412.6371 453.1509 474.8852 490.4293 494.4264 530.6154 556.3298 571.7556 577.8152 602.1701 649.9600 683.4034 688.9773 695.6318 740.7548 753.9210 781.6983 812.7292 815.0863 853.9926 857.6315 884.4327 900.2815 934.8237 941.4787 974.3747 993.4137 999.8994 1014.9686 1015.5713 1032.5521 1044.3983 1048.3667 1089.6074 1134.2940 1148.7027 1185.7958 1192.2178 1199.2823 1249.3923 1251.7905 1262.5275 1331.5861 1340.2898 1376.8873 1396.7711 1405.1159 1406.6068 1415.5254 1435.9859 1455.5936 1458.3669 1471.5344 1476.5958 1484.5243 1508.8223 1544.2496 1552.3585 1563.2770 1584.0203 1604.9056 1607.7751 1621.3313 2975.2440 2992.7014 3050.4725 3075.2588 3090.0302 3097.8144 3126.7375 3149.4513 3151.2671 3172.4420 3201.9903 3261.1295
redmass: 7.4089 5.8312 4.9013 1.4935 2.0249 4.1160 4.4636 1.7234 1.7931 4.1140 3.0638 6.3599 4.3065 5.0472 5.6698 7.1529 6.8236 6.6897 4.6501 5.1403 5.7404 4.5249 6.5584 3.9876 5.1264 4.0704 6.2798 3.5871 6.8275 4.3649 6.5474 5.4557 8.4962 1.3784 2.1729 5.4047 1.8768 6.2223 1.7215 5.5335 5.9073 1.3875 4.1385 3.4656 1.3686 2.0322 1.9987 1.3283 4.3592 1.4914 1.5548 2.0189 3.2807 3.4483 1.5494 1.4806 2.4634 1.9779 1.9190 1.8788 4.5369 4.0237 3.1513 3.3322 1.5125 1.6053 2.0168 3.2612 2.2194 1.0427 1.4629 1.0453 1.1478 4.3650 10.0622 5.6140 6.6714 9.1941 6.7386 7.4475 7.9760 1.0383 1.0366 1.0976 1.0972 1.0977 1.1007 1.0881 1.0953 1.0870 1.0973 1.0943 1.1004
irintensity: 1.1075 1.4848 0.0203 1.6173 0.3215 1.7062 0.4286 0.4387 1.0259 2.9151 4.3500 1.8705 0.0295 0.2184 1.3210 0.9233 1.3704 0.6549 10.2728 1.5115 2.6192 5.7967 3.7542 0.5788 0.6629 0.2743 1.2429 8.5874 2.8367 0.8550 10.2981 0.4212 3.1285 34.4261 8.6470 2.1761 40.4402 5.5893 40.4695 15.0465 23.2857 0.4981 3.9808 18.7356 0.2123 0.5209 11.8913 3.2739 0.8127 6.1701 6.4488 2.8092 18.5536 35.0394 13.9749 9.9873 11.3203 1.0333 27.9883 6.7188 2.2482 16.4588 58.6832 6.4300 15.8871 8.9633 11.9987 4.2433 8.5108 14.9379 1.5301 15.1276 25.3111 13.1979 238.8750 91.6192 6.0640 20.2380 96.9490 55.4263 47.0776 33.0137 19.9734 18.0152 9.4328 20.4726 24.9270 14.4944 30.1350 3.5312 8.1693 16.7053 0.4390
temp: 298.150 k
press: 1.00000 atm
elementType: 8 8 8 6 6 6 6 6 6 6 6 6 6 6 6 6 6 6 6 6 6 1 1 1 1 1 1 1 1 1 1 1 1
symmnumber: 1
zpe: 647328.3 jmol-1
zpe.correction: 0.246554 hartree
zpe.thermalcorrener: 0.263432 hartree
zpe.thermalcorrenthalpy: 0.264376 hartree
zpe.thermalcorrgfe: 0.202045 hartree
zpe.sumelectzpe: -917.359790 hartree
zpe.sumelectthermal: -917.342913 hartree
zpe.sumelectthermalent: -917.341968 hartree
zpe.sumelectthermalfe: -917.404299 hartree
dipole: 1.8258 -5.7206 0.0033
dipole: 6.0049
quadrupole: -91.9755 -126.5449 -123.2992
quadrupole: 9.4917 0.0132 0.0134
quadrupole: 21.9644 -12.6050 -9.3593 9.4917 0.0132 0.0134
hfenergy: -917.6063447 hartree
pointgroup: C01 [X(C18H12O3)]
dipole: -0.6707231 2.2653019 -0.0000713 debye
polarizability: 375.6253783|5.7016936|232.4683713|0.0338894|-0.0894982|85.5404126 unknown
InChI: InChI=1S/C18H12O3/c1-9-4-3-5-12-11(9)6-7-13-15(12)17(20)16(19)14-10(2)8-21-18(13)14/h3-8H,1-2H3
charge 0 multiplicity 1
33 atoms
O  2.450196 2.19516 -0.001084
O  0.205491 -2.813963 -0.001855
O  2.935922 -2.469383 0.004951
C  -0.273804 -0.411812 0.000589
C  0.327135 0.883953 0.000114
C  -1.72738 -0.51176 0.000548
C  1.77039 0.975472 0.000083
C  2.687923 -0.072423 0.001694
C  -2.523295 0.712918 -0.000073
C  0.621264 -1.619153 0.000683
C  -0.465422 2.069514 -0.00072
C  4.027022 0.500701 0.001028
C  2.197298 -1.443831 0.003937
C  -1.853431 1.978812 -0.000816
C  -3.96914 0.655441 0.000081
C  -2.427772 -1.765631 0.001425
C  3.835407 1.872364 -0.000578
C  -4.592998 -0.597148 0.001019
C  -3.823842 -1.797821 0.001742
C  5.332183 -0.24411 0.002071
C  -4.807057 1.9228 -0.000678
H  0.037416 3.040736 -0.001316
H  -2.448515 2.896859 -0.001521
H  -1.853051 -2.691412 0.001645
H  4.509917 2.723693 -0.001598
H  -5.687588 -0.655338 0.001167
H  -4.338625 -2.765155 0.002577
H  5.406789 -0.904231 -0.880313
H  6.191996 0.446836 0.001004
H  5.40682 -0.901597 0.886415
H  -4.609934 2.548253 -0.891952
H  -5.8810 1.673577 -0.000658
H  -4.610117 2.549179 0.889988
