program: Gaussian 09
title: 000114910
version: EM64L-G09RevD.01
frameworkgroup: C1[X(C20H12)]
method: RPBEPBE
basis: SDD
operation: Freq
keyword: #p
keyword: freq=noraman
keyword: PBEPBE/SDD
title: #p freq=noraman PBEPBE/SDD
converged: NO YES NO YES
title: Mulliken charges:
elementType: C C C C C C C C C C C C C C C C C C C C H H H H H H H H H H H H
charge: -0.403404 0.461900 0.152244 0.458270 0.323352 0.196658 0.493537 0.448987 -0.756552 -0.709384 -0.388909 -0.444780 -0.403709 -0.362303 -0.473927 -0.461093 -0.243916 -0.255422 -0.250008 -0.248707 0.234524 0.253276 0.243142 0.255912 0.240019 0.231067 0.246359 0.244692 0.228322 0.229942 0.228540 0.231369
chargesum: 0.00000
title: Mulliken charges with hydrogens summed into heavy atoms:
elementType: C C C C C C C C C C C C C C C C C C C C
charge: -0.403404 0.461900 0.152244 0.458270 0.323352 0.196658 0.493537 0.448987 -0.522028 -0.456107 -0.145767 -0.188868 -0.163689 -0.131236 -0.227567 -0.216401 -0.015594 -0.025480 -0.021468 -0.017339
polarizability: 4.09693307e+02 -1.12154886e-01 2.52928044e+02 -3.83926914e-03 5.75323170e-03 7.88233589e+01
1716.lowfreq: -0.0008 -0.0003 0.0006 5.1187 5.3838 9.4311 68.0709 86.1561 139.1637
frequency: 68.0303 86.1462 139.1608 152.7491 164.4120 244.7733 280.3586 281.1905 296.5051 355.9571 377.2117 381.4742 441.5337 445.5248 490.3407 508.5873 522.4723 558.5200 567.1869 584.6574 615.3074 644.4783 647.9716 661.2758 683.1959 723.3985 758.6751 760.7762 764.0659 773.5305 797.2943 803.5743 850.7834 863.8009 866.9212 878.6720 902.1997 915.9731 931.9636 943.1853 952.0474 965.0719 968.4757 991.3416 991.5053 1020.5845 1036.5712 1048.8723 1066.4780 1102.2626 1113.2174 1155.4195 1173.0914 1177.3273 1195.0441 1219.7237 1236.0785 1260.0656 1275.3445 1320.4421 1328.5211 1340.3877 1368.2222 1386.2900 1403.3382 1428.2387 1439.6294 1443.5120 1466.9453 1471.2424 1481.6372 1527.6429 1549.2999 1582.3023 1598.9235 1617.1745 1631.4334 1634.5749 3118.1501 3120.0802 3123.1031 3127.1925 3128.6075 3133.0995 3143.6419 3146.8269 3161.2784 3164.2046 3174.0140 3201.0614
redmass: 4.9102 4.0634 4.0995 4.6003 5.0949 4.4409 5.0513 4.1223 4.0501 5.7223 3.4106 5.9641 3.1141 6.0873 3.1202 5.7296 3.2091 3.0328 6.9694 6.0607 3.1831 6.0159 6.1186 3.7161 5.9114 2.3886 1.3416 6.0183 1.2886 1.6857 2.5180 5.6076 2.0479 4.6286 1.5291 1.4918 5.7188 1.4457 1.7827 2.0928 5.7199 1.4623 1.4750 1.3678 1.3553 2.2385 2.2721 3.0601 1.6921 2.3758 1.7715 1.5230 1.0904 1.0856 1.4889 1.5144 2.2793 1.7789 1.9418 1.9871 2.4064 3.6012 3.1698 3.9334 4.1562 3.5073 2.7373 4.4486 3.1412 2.8676 5.1114 5.1116 5.5380 7.3376 7.4196 6.3898 7.9344 7.0621 1.0866 1.0893 1.0896 1.0892 1.0882 1.0884 1.0951 1.0937 1.1005 1.1004 1.0887 1.1044
irintensity: 1.6182 0.0005 2.0542 0.1047 0.5370 3.1834 1.3999 0.0067 0.3133 0.1706 0.0055 0.1610 0.0003 0.1387 14.2054 1.6611 7.0989 0.0104 4.6019 8.4268 4.7854 4.8115 0.1982 4.4463 1.9619 10.6507 0.8603 5.2194 153.1332 26.1307 16.0475 1.3532 0.8058 0.6857 10.7166 10.8681 2.3797 0.8765 0.3099 24.5366 0.1611 6.5356 21.1967 1.1883 0.1201 5.6506 6.7704 2.4425 2.8887 8.0514 10.8954 15.8883 2.5406 3.8531 4.1801 7.9421 16.3908 7.0711 7.0973 0.6426 0.9895 10.8321 6.3043 2.0077 2.4300 10.7577 2.2794 6.7334 23.5553 7.1643 22.2102 20.5815 7.2015 3.6372 16.6868 0.4943 23.8163 4.4153 1.4478 0.4184 15.1051 3.2037 5.9816 0.6199 26.7578 29.0981 52.6849 39.5096 1.3508 19.7387
temp: 298.150 k
press: 1.00000 atm
elementType: 6 6 6 6 6 6 6 6 6 6 6 6 6 6 6 6 6 6 6 6 1 1 1 1 1 1 1 1 1 1 1 1
symmnumber: 1
zpe: 654616.8 jmol-1
zpe.correction: 0.249330 hartree
zpe.thermalcorrener: 0.262547 hartree
zpe.thermalcorrenthalpy: 0.263491 hartree
zpe.thermalcorrgfe: 0.209957 hartree
zpe.sumelectzpe: -768.056497 hartree
zpe.sumelectthermal: -768.043280 hartree
zpe.sumelectthermalent: -768.042336 hartree
zpe.sumelectthermalfe: -768.095870 hartree
dipole: -0.6687 -0.5540 0.0000
dipole: 0.8684
quadrupole: -93.8690 -98.2276 -124.2172
quadrupole: -0.4421 -0.0005 0.0009
quadrupole: 11.5689 7.2104 -18.7793 -0.4421 -0.0005 0.0009
hfenergy: -768.3058277 hartree
pointgroup: C01 [X(C20H12)]
dipole: -0.2631043 -0.2179698 0.0000096 debye
polarizability: 409.6932989|-0.1175581|252.9280515|-0.0038391|0.0057534|78.8233589 unknown
InChI: InChI=1S/C20H12/c1-4-8-17-13(5-1)11-15-9-10-18-16-7-3-2-6-14(16)12-19(17)20(15)18/h1-12H
charge 0 multiplicity 1
32 atoms
C  0.012177 0.85523 0.000116
C  -0.441768 -0.487383 0.000098
C  1.366602 1.261084 0.000111
C  -0.846496 2.023437 0.000175
C  2.386839 0.26524 0.000082
C  -1.899647 -0.687155 0.000115
C  1.950897 -1.13651 0.000061
C  -2.762911 0.48145 0.000183
C  0.563293 -1.485446 0.00006
C  -2.217653 1.833766 0.000208
C  1.364547 2.740214 0.000157
C  0.049451 3.195139 0.000246
C  3.792479 0.555063 0.000083
C  -2.502898 -1.975017 0.000052
C  2.961021 -2.162619 0.00005
C  -4.178607 0.295048 0.000196
C  4.73695 -0.471234 0.00006
C  -3.899894 -2.130595 0.00007
C  4.317472 -1.843649 0.000042
C  -4.74556 -0.987944 0.000132
H  0.305535 -2.551083 0.000061
H  -2.921365 2.675722 0.000289
H  2.255899 3.371675 0.000153
H  -0.274512 4.23751 0.000303
H  4.116986 1.601631 0.000093
H  -1.866097 -2.866194 -0.000009
H  2.641887 -3.211927 0.000035
H  -4.825586 1.180765 0.000241
H  5.806667 -0.233789 0.00005
H  -4.337666 -3.134838 0.000033
H  5.070762 -2.639016 0.000019
H  -5.833907 -1.110475 0.000133
