program: Gaussian 09
title: 000114896
version: EM64L-G09RevD.01
frameworkgroup: C1[X(C12H4BrCl3O2)]
method: RPBEPBE
basis: SDD
operation: Freq
keyword: #p
keyword: freq=noraman
keyword: PBEPBE/SDD
title: #p freq=noraman PBEPBE/SDD
converged: NO NO NO NO
title: Mulliken charges:
elementType: Br Cl Cl Cl O O C C C C C C C C C C C C H H H H
charge: 0.071395 0.012075 0.010779 0.010794 -0.267410 -0.267577 0.250899 0.270265 0.267356 0.264600 -0.310958 -0.336369 -0.344549 -0.344058 -0.192820 -0.075811 -0.088581 -0.089041 0.285947 0.292447 0.290308 0.290307
chargesum: 0.00000
title: Mulliken charges with hydrogens summed into heavy atoms:
elementType: Br Cl Cl Cl O O C C C C C C C C C C C C
charge: 0.071395 0.012075 0.010779 0.010794 -0.267410 -0.267577 0.250899 0.270265 0.267356 0.264600 -0.025011 -0.043922 -0.054241 -0.053751 -0.192820 -0.075811 -0.088581 -0.089041
polarizability: 3.51457250e+02 2.72685932e+00 1.74508341e+02 -2.69615382e-03 8.12105194e-03 6.17464835e+01
1716.lowfreq: -3.4838 0.0020 0.0028 0.0029 5.2957 8.7784 21.8433 42.3247 95.4098
frequency: 21.8405 42.3239 95.4082 102.4173 126.2288 149.6084 158.6133 174.2705 193.3961 205.0457 225.2558 270.9168 293.0998 353.4580 361.3843 368.0729 404.8845 442.3997 445.3936 455.4727 504.0692 525.9092 580.4263 598.2111 600.7680 620.2147 655.3280 658.6651 669.0340 717.8759 748.7553 842.9786 844.7218 850.0485 865.5625 870.6310 876.2918 930.7724 1093.7692 1100.7427 1109.2190 1113.3905 1216.4925 1220.5725 1228.0687 1281.4967 1340.5136 1352.8852 1370.4355 1373.0268 1459.3629 1472.7366 1558.8733 1580.5711 1587.3366 1633.9567 3175.0731 3175.8207 3177.5478 3178.0903
redmass: 17.1966 22.8652 18.5443 10.8064 10.3696 29.6721 11.9144 34.8127 22.7272 5.4363 18.4236 7.9011 14.8692 13.8682 11.9974 12.2609 15.5845 3.1007 3.1205 8.5368 5.2042 12.4119 11.3948 12.1259 10.1365 9.2660 4.1325 7.6821 3.9075 7.2035 7.7865 5.6866 1.4095 1.4282 9.4001 1.3794 1.3830 11.1900 1.8582 1.6884 6.5969 10.4201 5.4016 1.2227 1.3160 5.0952 8.9198 9.1348 6.6075 7.6201 3.7428 4.1757 10.6805 8.0094 10.5792 8.5461 1.0924 1.0922 1.0930 1.0931
irintensity: 0.0088 0.0025 0.0311 0.0043 0.0013 0.1345 0.8698 0.1775 0.0134 0.0474 0.0149 0.0352 0.1116 1.0719 0.4893 6.4167 17.1339 0.0083 18.4480 9.9830 0.2903 0.1243 0.0303 0.0489 0.1714 0.0061 0.0507 23.8061 0.0392 0.0573 23.1143 197.4784 0.0130 0.3418 43.0841 17.3103 91.2103 0.1611 153.6705 49.5715 71.8629 0.5723 2.3120 0.0041 2.2124 326.7664 1.7093 125.1975 1.9304 36.0278 1125.6046 25.1878 29.1559 0.1604 0.0997 5.6415 2.1138 3.5279 2.5841 0.6418
temp: 298.150 k
press: 1.00000 atm
elementType: 35 17 17 17 8 8 6 6 6 6 6 6 6 6 6 6 6 6 1 1 1 1
symmnumber: 1
zpe: 326878.0 jmol-1
zpe.correction: 0.124501 hartree
zpe.thermalcorrener: 0.140096 hartree
zpe.thermalcorrenthalpy: 0.141040 hartree
zpe.thermalcorrgfe: 0.079031 hartree
zpe.sumelectzpe: -2002.492809 hartree
zpe.sumelectthermal: -2002.477214 hartree
zpe.sumelectthermalent: -2002.476270 hartree
zpe.sumelectthermalfe: -2002.538279 hartree
dipole: 0.1316 -0.0702 0.0000
dipole: 0.1492
quadrupole: -150.8230 -125.6282 -134.8401
quadrupole: -2.5994 0.0000 0.0010
quadrupole: -13.7259 11.4689 2.2570 -2.5994 0.0000 0.0010
hfenergy: -2002.6173104 hartree
pointgroup: C01 [X(C12H4Br1Cl3O2)]
dipole: -0.0500424 -0.0306635 -0.0000172 debye
dipolederiv: -0.5044138 -0.2499718 0.0000057 -0.3571518 -0.1553929 0.0000036 0.0000234 0.0000112 0.0188942 -0.5946927 0.2945486 0.0000361 0.3890857 -0.2627933 -0.0000237 0.000005 -0.0000029 -0.0212566 -0.6303513 0.2799927 -0.0000506 0.3881537 -0.2408797 0.0000373 -0.0000606 0.0000345 -0.0173621 -0.6349209 -0.284218 0.000033 -0.384802 -0.2397385 0.000028 0.0000681 0.0000408 -0.0173117 -2.3117877 -0.0164313 0.0000032 0.0065734 -0.3476311 0.0000014 -0.0000159 -0.0000215 -0.1435636 -2.3221123 -0.0229044 0.0000179 -0.0071872 -0.3574455 0.0000484 0.000031 0.0000686 -0.1459875 1.3778098 -0.1736543 -0.0000039 -1.0301386 0.1221316 0.0000173 0.000086 0.0000159 0.0736112 1.4035721 0.180739 -0.0001067 1.0369808 0.1648851 -0.0000279 -0.0002449 -0.0000314 0.0793357 1.384102 0.1786756 0.0000361 1.0359662 0.1461993 0.0000055 -0.0000078 0.0000215 0.0732204 1.3830216 -0.1622594 0.0000537 -1.046856 0.1354035 -0.000027 0.0001506 -0.0000226 0.0724595 -0.4714216 -0.0716581 -0.0000136 -0.1592139 -0.0577391 -0.0000043 -0.0000172 -0.0000131 -0.0877072 -0.4142184 0.0914646 0.0000118 0.0718155 -0.0766342 -0.000024 0.000028 -0.0000152 -0.1017245 -0.4231361 0.0647399 -0.0000078 0.0948872 -0.0597452 0.0000053 -0.0000269 -0.0000048 -0.0985179 -0.4228867 -0.0693095 0.0000236 -0.0920527 -0.0576778 -0.0000154 0.0000199 -0.0000039 -0.0984589 0.7337513 0.6129085 0.0000154 0.6974867 0.2333553 -0.0000132 -0.0000175 -0.0000235 -0.1288369 0.6130347 -0.6529441 -0.0000724 -0.635014 0.317959 0.0000364 -0.0000417 0.0000055 -0.0463607 0.7147489 -0.5566932 0.0000928 -0.6657627 0.2953952 -0.0000608 0.0001266 -0.0000458 -0.0655393 0.7244133 0.5596319 -0.0000756 0.6636024 0.2914083 -0.0000431 -0.0001136 -0.0000727 -0.0658363 0.1034195 0.0249483 -0.0000009 0.0145138 0.0309592 0.0000078 -0.0000065 0.0000126 0.1767208 0.0910722 -0.0276527 0.0000133 -0.0200745 0.0382111 0.0000087 0.0000354 0.0000127 0.1818348 0.1000932 -0.0222796 -0.000002 -0.0187144 0.039917 0.0000174 -0.0000127 0.0000127 0.1811416 0.1009029 0.0223273 -0.0000092 0.0179024 0.0398527 0.0000224 -0.0000088 0.0000215 0.1812449 unknown
polarizability: 351.1468805|7.8904386|174.8187105|-0.002204|-0.0082682|61.7464835 unknown
InChI: InChI=1S/C12H4BrCl3O2/c13-5-1-9-10(2-6(5)14)18-12-4-8(16)7(15)3-11(12)17-9/h1-4H
charge 0 multiplicity 1
22 atoms
Br -5.291966 -1.704156 0.000078
Cl -5.147918 1.687126 0.000225
Cl 5.169713 -1.663835 0.000305
Cl 5.183068 1.629491 -0.00016
O  0.000289 -1.457364 -0.000024
O  0.012524 1.464819 -0.000365
C  -1.195845 -0.700955 -0.000022
C  -1.189488 0.718667 -0.000157
C  1.202891 -0.711218 0.00001
C  1.20893 0.70857 -0.000195
C  -2.410358 -1.399982 0.000059
C  -2.396537 1.428169 -0.000061
C  2.410696 -1.420491 0.000188
C  2.422231 1.408251 -0.000211
C  -3.631524 -0.687846 0.000068
C  -3.623459 0.727197 0.000117
C  3.635911 -0.718274 0.000151
C  3.641725 0.69622 -0.000033
H  -2.39483 -2.493008 0.000125
H  -2.375732 2.521341 -0.000134
H  2.391514 -2.513676 0.00032
H  2.411666 2.501553 -0.000384
